BDBM249758 US9447038, 186
SMILES CCCN(Cc1ccc(OCCN2C(=O)CCC2=O)c(OC)c1)C(C(C)C(O)=O)c1ccc(Cl)cc1
InChI Key InChIKey=ZPDFHXCTJWAPIV-UHFFFAOYSA-N
Data  2 IC50
  Tab Delimited (TSV)   2D SDfile   Computed 3D by Vconf -m prep SDfile
Find this compound or compounds like it in BindingDB:
Activity Spreadsheet -- Enzyme Inhibition Constant Data from BindingDB
Found 2 hits for monomerid = 249758
TargetC-X-C chemokine receptor type 3(Homo sapiens (Human))
Sanofi
Curated by ChEMBL
LigandPNGBDBM249758(US9447038, 186)
Affinity DataIC50:  73nM. Assay description: Displacement of [125I]-CXCL10 from human recombinant CXCR3 transfected in Flp-In-CHO cell membranes after 60 mins by gamma counting method
Ligand InfoPC cidPC sid
In DepthDetails ArticlePubMed
TargetC-X-C motif chemokine 10(Homo sapiens (Human))
Sanofi
US Patent
LigandPNGBDBM249758(US9447038, 186)
Affinity DataIC50:  73nMT: 2°C. Assay description: The composition of the binding assay buffer is determined in a course of detailed optimization procedure. This resulted in a binding assay buffer con...
Ligand InfoPC cidPC sid
In DepthDetails US Patent