BDBM249996 US10005782, Compound 122::US9447106, 122::US9556188, Compound 122
SMILES CN(C)C\C=C\C(=O)N1CCc2[nH]c3c(C(N)=O)c(nn3c2CC1)-c1ccc(Oc2ccccc2)cc1
InChI Key InChIKey=RKSWJHGSLYMWRE-RMKNXTFCSA-N
Data  3 IC50
  Tab Delimited (TSV)   2D SDfile   Computed 3D by Vconf -m prep SDfile
Find this compound or compounds like it in BindingDB:
Activity Spreadsheet -- Enzyme Inhibition Constant Data from BindingDB
Found 3 hits for monomerid = 249996
TargetTyrosine-protein kinase BTK(Homo sapiens (Human))
Beigene
US Patent
LigandPNGBDBM249996(US10005782, Compound 122 | US9447106, 122 | US9556...)
Affinity DataIC50:  0.780nMT: 2°C. Assay description: Compounds disclosed herein were tested for inhibition of Btk kinase activity in an assay based on time-resolved fluorescence resonance energy transfe...
Ligand InfoPC cidPC sid
In DepthDetails US Patent
TargetTyrosine-protein kinase BTK(Homo sapiens (Human))
Beigene
US Patent
LigandPNGBDBM249996(US10005782, Compound 122 | US9447106, 122 | US9556...)
Affinity DataIC50:  0.780nM. Assay description: Compounds disclosed herein were tested for inhibition of Btk kinase activity in an assay based on time-resolved fluorescence resonance energy transfe...
Ligand InfoPC cidPC sid
In DepthDetails US Patent
TargetTyrosine-protein kinase BTK(Homo sapiens (Human))
Beigene
US Patent
LigandPNGBDBM249996(US10005782, Compound 122 | US9447106, 122 | US9556...)
Affinity DataIC50:  0.780nMT: 2°C. Assay description: Compounds disclosed herein were tested for inhibition of Btk kinase activity in an assay based on time-resolved fluorescence resonance energy transfe...
Ligand InfoPC cidPC sid
In DepthDetails US Patent