BDBM250021 US10005782, Compound 143::US9447106, 143::US9556188, Compound 143
SMILES CC1(CNC(=O)C=C)CCNc2c(C(N)=O)c(nn12)-c1ccc(Oc2ccccc2)cc1
InChI Key InChIKey=OSFVFJLOFLIGBP-UHFFFAOYSA-N
Data  3 IC50
  Tab Delimited (TSV)   2D SDfile   Computed 3D by Vconf -m prep SDfile
Find this compound or compounds like it in BindingDB:
Activity Spreadsheet -- Enzyme Inhibition Constant Data from BindingDB
Found 3 hits for monomerid = 250021
TargetTyrosine-protein kinase BTK(Homo sapiens (Human))
Beigene
US Patent
LigandPNGBDBM250021(US10005782, Compound 143 | US9447106, 143 | US9556...)
Affinity DataIC50:  0.890nMT: 2°C. Assay description: Compounds disclosed herein were tested for inhibition of Btk kinase activity in an assay based on time-resolved fluorescence resonance energy transfe...
Ligand InfoPC cidPC sid
In DepthDetails US Patent
TargetTyrosine-protein kinase BTK(Homo sapiens (Human))
Beigene
US Patent
LigandPNGBDBM250021(US10005782, Compound 143 | US9447106, 143 | US9556...)
Affinity DataIC50:  0.890nM. Assay description: Compounds disclosed herein were tested for inhibition of Btk kinase activity in an assay based on time-resolved fluorescence resonance energy transfe...
Ligand InfoPC cidPC sid
In DepthDetails US Patent
TargetTyrosine-protein kinase BTK(Homo sapiens (Human))
Beigene
US Patent
LigandPNGBDBM250021(US10005782, Compound 143 | US9447106, 143 | US9556...)
Affinity DataIC50:  0.890nMT: 2°C. Assay description: Compounds disclosed herein were tested for inhibition of Btk kinase activity in an assay based on time-resolved fluorescence resonance energy transfe...
Ligand InfoPC cidPC sid
In DepthDetails US Patent