BDBM250037 US10005782, Compound 159::US9447106, 159::US9556188, Compound 159
SMILES COc1cc(ccc1F)-c1nn2C(CCNc2c1C(N)=O)c1ccccc1NC(=O)C=C
InChI Key InChIKey=QXNWRCJRWRSYJI-UHFFFAOYSA-N
Data  3 IC50
  Tab Delimited (TSV)   2D SDfile   Computed 3D by Vconf -m prep SDfile
Find this compound or compounds like it in BindingDB:
Activity Spreadsheet -- Enzyme Inhibition Constant Data from BindingDB
Found 3 hits for monomerid = 250037
TargetTyrosine-protein kinase BTK(Homo sapiens (Human))
Beigene
US Patent
LigandPNGBDBM250037(US10005782, Compound 159 | US9447106, 159 | US9556...)
Affinity DataIC50:  1nMT: 2°C. Assay description: Compounds disclosed herein were tested for inhibition of Btk kinase activity in an assay based on time-resolved fluorescence resonance energy transfe...
Ligand InfoPC cidPC sid
In DepthDetails US Patent
TargetTyrosine-protein kinase BTK(Homo sapiens (Human))
Beigene
US Patent
LigandPNGBDBM250037(US10005782, Compound 159 | US9447106, 159 | US9556...)
Affinity DataIC50:  1nM. Assay description: Compounds disclosed herein were tested for inhibition of Btk kinase activity in an assay based on time-resolved fluorescence resonance energy transfe...
Ligand InfoPC cidPC sid
In DepthDetails US Patent
TargetTyrosine-protein kinase BTK(Homo sapiens (Human))
Beigene
US Patent
LigandPNGBDBM250037(US10005782, Compound 159 | US9447106, 159 | US9556...)
Affinity DataIC50:  1nMT: 2°C. Assay description: Compounds disclosed herein were tested for inhibition of Btk kinase activity in an assay based on time-resolved fluorescence resonance energy transfe...
Ligand InfoPC cidPC sid
In DepthDetails US Patent