BDBM250051 US10005782, Compound 173::US9447106, 173::US9556188, Compound 173
SMILES NC(=O)c1c2NCCC(C3CCN(CC3)C(=O)C=C)n2nc1-c1ccc(Oc2ccccc2)c(Cl)c1
InChI Key InChIKey=MODKQWIWLUEOCI-UHFFFAOYSA-N
Data  6 IC50
  Tab Delimited (TSV)   2D SDfile   Computed 3D by Vconf -m prep SDfile
Find this compound or compounds like it in BindingDB:
Activity Spreadsheet -- Enzyme Inhibition Constant Data from BindingDB
Found 6 hits for monomerid = 250051
TargetTyrosine-protein kinase BTK(Homo sapiens (Human))
Beigene
US Patent
LigandPNGBDBM250051(US10005782, Compound 173 | US9447106, 173 | US9556...)
Affinity DataIC50:  0.810nMT: 2°C. Assay description: Compounds disclosed herein were tested for inhibition of Btk kinase activity in an assay based on time-resolved fluorescence resonance energy transfe...
Ligand InfoPC cidPC sid
In DepthDetails US Patent
TargetTyrosine-protein kinase BTK(Homo sapiens (Human))
Beigene
US Patent
LigandPNGBDBM250051(US10005782, Compound 173 | US9447106, 173 | US9556...)
Affinity DataIC50:  0.810nMT: 2°C. Assay description: Compounds disclosed herein were tested for inhibition of Btk kinase activity in an assay based on time-resolved fluorescence resonance energy transfe...
Ligand InfoPC cidPC sid
In DepthDetails US Patent
TargetTyrosine-protein kinase Tec(Homo sapiens (Human))TBA
LigandPNGBDBM250051(US10005782, Compound 173 | US9447106, 173 | US9556...)
Affinity DataIC50:  5.10nM. Assay description: Inhibition of TEC (unknown origin) preincubated for 1 hrs followed by substrate addition and measured after 1 hrs in the presence of ATP at Km concen...
Ligand InfoPC cidPC sid
In DepthDetails PubMed
TargetTyrosine-protein kinase BTK(Homo sapiens (Human))
Beigene
US Patent
LigandPNGBDBM250051(US10005782, Compound 173 | US9447106, 173 | US9556...)
Affinity DataIC50:  0.800nM. Assay description: Inhibition of N-terminal His-tagged recombinant human BTK (393 to 659 residues) expressed in baculovirus infected Sf9 cells using Biotin-AVLESEEELYSS...
Ligand InfoPC cidPC sid
In DepthDetails PubMed
TargetEpidermal growth factor receptor(Homo sapiens (Human))TBA
LigandPNGBDBM250051(US10005782, Compound 173 | US9447106, 173 | US9556...)
Affinity DataIC50:  1.70nM. Assay description: Inhibition of EGFR (unknown origin) preincubated for 1 hrs followed by substrate addition and measured after 1 hrs in the presence of ATP at Km conce...
Ligand InfoPC cidPC sid
In DepthDetails PubMed
TargetTyrosine-protein kinase BTK(Homo sapiens (Human))
Beigene
US Patent
LigandPNGBDBM250051(US10005782, Compound 173 | US9447106, 173 | US9556...)
Affinity DataIC50:  0.810nM. Assay description: Compounds disclosed herein were tested for inhibition of Btk kinase activity in an assay based on time-resolved fluorescence resonance energy transfe...
Ligand InfoPC cidPC sid
In DepthDetails US Patent