BDBM250066 US10005782, Compound 191::US9447106, 191::US9556188, Compound 191
SMILES NC(=O)c1c2NCC[C@@H](C3CCN(CC3)C(=O)C#CCO)n2nc1-c1ccc(Oc2ccccc2)cc1
InChI Key InChIKey=SSYAMKKNCFUJMB-QHCPKHFHSA-N
Data  3 IC50
  Tab Delimited (TSV)   2D SDfile   Computed 3D by Vconf -m prep SDfile
Find this compound or compounds like it in BindingDB:
Activity Spreadsheet -- Enzyme Inhibition Constant Data from BindingDB
Found 3 hits for monomerid = 250066
TargetTyrosine-protein kinase BTK(Homo sapiens (Human))
Beigene
US Patent
LigandPNGBDBM250066(US10005782, Compound 191 | US9447106, 191 | US9556...)
Affinity DataIC50:  0.670nMT: 2°C. Assay description: Compounds disclosed herein were tested for inhibition of Btk kinase activity in an assay based on time-resolved fluorescence resonance energy transfe...
Ligand InfoPC cidPC sid
In DepthDetails US Patent
TargetTyrosine-protein kinase BTK(Homo sapiens (Human))
Beigene
US Patent
LigandPNGBDBM250066(US10005782, Compound 191 | US9447106, 191 | US9556...)
Affinity DataIC50:  0.670nM. Assay description: Compounds disclosed herein were tested for inhibition of Btk kinase activity in an assay based on time-resolved fluorescence resonance energy transfe...
Ligand InfoPC cidPC sid
In DepthDetails US Patent
TargetTyrosine-protein kinase BTK(Homo sapiens (Human))
Beigene
US Patent
LigandPNGBDBM250066(US10005782, Compound 191 | US9447106, 191 | US9556...)
Affinity DataIC50:  0.670nMT: 2°C. Assay description: Compounds disclosed herein were tested for inhibition of Btk kinase activity in an assay based on time-resolved fluorescence resonance energy transfe...
Ligand InfoPC cidPC sid
In DepthDetails US Patent