BDBM250244 US11697636, Example 154::US9452980, 154
SMILES Clc1ccc(cc1Cl)C(=O)Nc1ccc(CCC2CCCN2)cc1
InChI Key InChIKey=AJLQUOXNZAXTHI-UHFFFAOYSA-N
Data  4 KI
  Tab Delimited (TSV)   2D SDfile   Computed 3D by Vconf -m prep SDfile
Find this compound or compounds like it in BindingDB:
Activity Spreadsheet -- Enzyme Inhibition Constant Data from BindingDB
Found 2 hits for monomerid = 250244
TargetTrace amine-associated receptor 1(Rattus norvegicus (Rat))
Hoffmann-La Roche
US Patent
LigandPNGBDBM250244(US11697636, Example 154 | US9452980, 154)
Affinity DataKi:  0.200nM ΔG°:  -13.8kcal/molepH: 7.4 T: 2°C. Assay description: HEK-293 cells stably expressing rat TAAR1 were maintained at 37° C. and 5% CO2 in DMEM high glucose medium, containing fetal calf serum (10%, hea...
Ligand InfoPC cidPC sid
In DepthDetails US Patent
TargetTrace amine-associated receptor 1(Mus musculus (Mouse))
Hoffmann-La Roche
US Patent
LigandPNGBDBM250244(US11697636, Example 154 | US9452980, 154)
Affinity DataKi:  8.20nM ΔG°:  -11.5kcal/molepH: 7.4 T: 2°C. Assay description: HEK-293 cells stably expressing mouse TAAR1 were maintained at 37° C. and 5% CO2 in DMEM high glucose medium, containing fetal calf serum (10%, h...
Ligand InfoPC cidPC sid
In DepthDetails US Patent