BDBM251887 US9475806, 17-C
SMILES Cc1cc(C2CC2)c(c2cc[nH]c12)C(C)(O)c1nc2cc(cnc2[nH]1)C#N
InChI Key
Data  1 IC50
  Tab Delimited (TSV)   2D SDfile   Computed 3D by Vconf -m prep SDfile
Find this compound or compounds like it in BindingDB:
Activity Spreadsheet -- Enzyme Inhibition Constant Data from BindingDB
Found 1 hit for monomerid = 251887
TargetComplement factor B(Homo sapiens (Human))
Novartis
US Patent
LigandPNGBDBM251887(US9475806, 17-C)
Affinity DataIC50:  60nMpH: 7.4 T: 2°C. Assay description: Recombinant human factor B (expressed in drosophila cells and purified using standard methods) labeled with biotin (10 nM), europium-labeled streptav...
Ligand InfoPC cidPC sid
In DepthDetails US Patent