BDBM254834 US9487554, 21
SMILES C[C@]12CC[C@H]3[C@@H](CCc4cc(ccc34)C(=O)NCCC(O)=O)[C@@H]1CC=C2c1cncc(c1)C(F)(F)F
InChI Key InChIKey=KUUNHRVBSLMYJF-FQUWXVCBSA-N
Data  1 IC50
  Tab Delimited (TSV)   2D SDfile   Computed 3D by Vconf -m prep SDfile
Find this compound or compounds like it in BindingDB:
Activity Spreadsheet -- Enzyme Inhibition Constant Data from BindingDB
Found 1 hit for monomerid = 254834
TargetAldo-keto reductase family 1 member C3/Glutathione S-transferase P(Homo sapiens (Human))
Bayer Intellectual Property
US Patent
LigandPNGBDBM254834(US9487554, 21)
Affinity DataIC50:  8.5nMpH: 7.0Assay Description:Essentially, the enzyme activity is measured by quantification of the Coumberol from Coumberone (Halim, M., Yee, D. J., and Sames, D., J. AM. CHEM. S...
Ligand InfoPC cidPC sid
In DepthDetails US Patent