BDBM257166 US9493440, 6
SMILES CC1(CC1)Oc1ccc2[nH]nc(-c3cc(ncn3)N3CCOC4(CC4)C3)c2c1
InChI Key InChIKey=NANBOXCVUSRMNS-UHFFFAOYSA-N
Data  1 IC50
  Tab Delimited (TSV)   2D SDfile   Computed 3D by Vconf -m prep SDfile
Find this compound or compounds like it in BindingDB:
Activity Spreadsheet -- Enzyme Inhibition Constant Data from BindingDB
Found 1 hit for monomerid = 257166
TargetLeucine-rich repeat serine/threonine-protein kinase 2 [970-2527,G2019S](Homo sapiens (Human))
Merck Sharp & Dohme
US Patent
LigandPNGBDBM257166(US9493440, 6)
Affinity DataIC50:  1.51nMpH: 8.5 T: 2°C. Assay description: a) 400 nl of a 1:2.15 serial dilution of test compound (98 uM top assay concentration) is spotted via Labcyte Echo to certain wells in a 384 well bla...
Ligand InfoPC cidPC sid
In DepthDetails US Patent