BDBM258174 US9493448, 79::US9597330, Example 24::US9845313, Example 79
SMILES Cn1nccc1[C@H]1CCCC[C@@H]1Oc1ccc(c(F)c1Cl)S(=O)(=O)Nc1ccncn1
InChI Key InChIKey=HHONPUIFSAEMPU-HIFRSBDPSA-N
Data  3 IC50
  Tab Delimited (TSV)   2D SDfile   Computed 3D by Vconf -m prep SDfile
Find this compound or compounds like it in BindingDB:
Activity Spreadsheet -- Enzyme Inhibition Constant Data from BindingDB
Found 3 hits for monomerid = 258174
TargetSodium channel protein type 9 subunit alpha(Homo sapiens (Human))
Daiichi Sankyo
US Patent
LigandPNGBDBM258174(US9493448, 79 | US9597330, Example 24 | US9845313,...)
Affinity DataIC50:  70nMpH: 7.3 T: 2°C. Assay description: Current record was obtained by an automated patch clamp system IonWorks Quattro (Molecular Devices Corporation) in Population Patch Clamp mode. The o...
Ligand InfoPC cidPC sid
In DepthDetails US Patent
TargetSodium channel protein type 9 subunit alpha(Homo sapiens (Human))
Daiichi Sankyo
US Patent
LigandPNGBDBM258174(US9493448, 79 | US9597330, Example 24 | US9845313,...)
Affinity DataIC50:  70nM. Assay description: Current record was obtained by an automated patch clamp system “IonWorks Quattro (Molecular Devices Corporation)” in Population Patch Clamp mode. The...
Ligand InfoPC cidPC sid
In DepthDetails US Patent
TargetSodium channel protein type 9 subunit alpha(Homo sapiens (Human))
Daiichi Sankyo
US Patent
LigandPNGBDBM258174(US9493448, 79 | US9597330, Example 24 | US9845313,...)
Affinity DataIC50:  70nM. Assay description: Current recording was obtained by an automated patch clamp system IonWorks Quattro (Molecular Devices Corporation) in Population Patch Clamp mode. Th...
Ligand InfoPC cidPC sid
In DepthDetails US Patent