BDBM258397 US9505786, 35
SMILES Cc1ncc(s1)-c1nc(nc2NC(=O)C(C)(C)c12)-c1nn(Cc2ccccc2F)c2ncccc12
InChI Key InChIKey=PQYJGQJVGDQIAI-UHFFFAOYSA-N
Data  1 IC50
  Tab Delimited (TSV)   2D SDfile   Computed 3D by Vconf -m prep SDfile
Find this compound or compounds like it in BindingDB:
Activity Spreadsheet -- Enzyme Inhibition Constant Data from BindingDB
Found 1 hit for monomerid = 258397
TargetcGMP-specific 3',5'-cyclic phosphodiesterase(Homo sapiens (Human))
Bayer Pharma Aktiengesellschaft
US Patent
LigandPNGBDBM258397(US9505786, 35)
Affinity DataIC50:  120nMpH: 7.5 T: 2°C. Assay description: To determine their in vitro action on human PDE 5, the test substances are dissolved in 100% DMSO and serially diluted. Typically, dilution series (1...
Ligand InfoPC cidPC sid
In DepthDetails US Patent