BDBM258957 US9499502, 9bh
SMILES Cc1ccc(nc1)C(=O)Nc1cc(F)c(F)c(c1)[C@]1(C)CS(=O)(=O)C(C)(C)C(=N)N1
InChI Key InChIKey=KVYQRJSWPRRNAF-FQEVSTJZSA-N
Data  2 KI
  Tab Delimited (TSV)   2D SDfile   Computed 3D by Vconf -m prep SDfile
Find this compound or compounds like it in BindingDB:
Activity Spreadsheet -- Enzyme Inhibition Constant Data from BindingDB
Found 2 hits for monomerid = 258957
TargetBeta-secretase 2(Homo sapiens (Human))
Merck Sharp & Dohme
US Patent
LigandPNGBDBM258957(US9499502, 9bh)
Affinity DataKi:  4nM ΔG°:  -11.6kcal/molepH: 5.0 T: 2°C. Assay description: Inhibitor IC50s at purified human autoBACE-2 are determined in a time-resolved endpoint proteolysis assay that measures hydrolysis of the QSY7-EISEVN...
Ligand InfoPC cidPC sid
In DepthDetails US Patent
TargetBeta-secretase 1(Homo sapiens (Human))
Merck Sharp & Dohme
US Patent
LigandPNGBDBM258957(US9499502, 9bh)
Affinity DataKi:  13nM ΔG°:  -10.9kcal/molepH: 5.0 T: 2°C. Assay description: A homogeneous time-resolved FRET assay can be used to determine IC50 values for inhibitors of the soluble human BACE1 catalytic domain. This assay mo...
Ligand InfoPC cidPC sid
In DepthDetails US Patent