BDBM259169 US9499502, 27bk-a
SMILES C[C@]1(CS(=O)(=O)[C@@](C)(CC(F)(F)F)C(=N)N1)c1sc(cc1F)-c1cccc(c1)-c1nnco1
InChI Key InChIKey=LJVPBFAZHIFHIY-OALUTQOASA-N
Data  2 KI
  Tab Delimited (TSV)   2D SDfile   Computed 3D by Vconf -m prep SDfile
Find this compound or compounds like it in BindingDB:
Activity Spreadsheet -- Enzyme Inhibition Constant Data from BindingDB
Found 2 hits for monomerid = 259169
TargetBeta-secretase 1(Homo sapiens (Human))
Merck Sharp & Dohme
US Patent
LigandPNGBDBM259169(US9499502, 27bk-a)
Affinity DataKi:  4.70nM ΔG°:  -11.5kcal/molepH: 5.0 T: 2°C. Assay description: A homogeneous time-resolved FRET assay can be used to determine IC50 values for inhibitors of the soluble human BACE1 catalytic domain. This assay mo...
Ligand InfoPC cidPC sid
In DepthDetails US Patent
TargetBeta-secretase 2(Homo sapiens (Human))
Merck Sharp & Dohme
US Patent
LigandPNGBDBM259169(US9499502, 27bk-a)
Affinity DataKi:  9nM ΔG°:  -11.2kcal/molepH: 5.0 T: 2°C. Assay description: Inhibitor IC50s at purified human autoBACE-2 are determined in a time-resolved endpoint proteolysis assay that measures hydrolysis of the QSY7-EISEVN...
Ligand InfoPC cidPC sid
In DepthDetails US Patent