BDBM259268 US9499547, 9
SMILES COc1ccc2oc(cc2c1)-c1cnc2ccc(OCCCN)nn12
InChI Key InChIKey=JANRDTYHHAVPLZ-UHFFFAOYSA-N
Data  2 IC50
  Tab Delimited (TSV)   2D SDfile   Computed 3D by Vconf -m prep SDfile
Find this compound or compounds like it in BindingDB:
Activity Spreadsheet -- Enzyme Inhibition Constant Data from BindingDB
Found 2 hits for monomerid = 259268
LigandPNGBDBM259268(US9499547, 9)
Affinity DataIC50:  22nMpH: 7.5 T: 2°C. Assay description: MKNK1-inhibitory activity at high ATP of compounds of the present invention after their preincubation with MKNK1 was quantified employing the TR-FRET...
Ligand InfoPC cidPC sid
In DepthDetails US Patent
LigandPNGBDBM259268(US9499547, 9)
Affinity DataIC50:  7nMpH: 7.5 T: 2°C. Assay description: A recombinant fusion protein of Glutathione-S-Transferase (GST, N-terminally) and human full-length MKNK1 (amino acids 1-424 and T344D of accession n...
Ligand InfoPC cidPC sid
In DepthDetails US Patent