BDBM259280 US9499547, 21
SMILES NCCOCCOc1ccc2ncc(-c3cc4ccccc4o3)n2n1
InChI Key InChIKey=PRSSWDWEJRSSQB-UHFFFAOYSA-N
Data  1 IC50
  Tab Delimited (TSV)   2D SDfile   Computed 3D by Vconf -m prep SDfile
Find this compound or compounds like it in BindingDB:
Activity Spreadsheet -- Enzyme Inhibition Constant Data from BindingDB
Found 1 hit for monomerid = 259280
LigandPNGBDBM259280(US9499547, 21)
Affinity DataIC50:  14nMpH: 7.5 T: 2°C. Assay description: MKNK1-inhibitory activity at high ATP of compounds of the present invention after their preincubation with MKNK1 was quantified employing the TR-FRET...
Ligand InfoPC cidPC sid
In DepthDetails US Patent