BDBM259959 US9512121, 43
SMILES Cn1cc(cn1)-c1ccc2nnc(Sc3ccc4ncc(C(=O)N5CCOCC5)c(Cl)c4c3)n2c1
InChI Key InChIKey=LCATXJCWPJHBEX-UHFFFAOYSA-N
Data  1 IC50
  Tab Delimited (TSV)   2D SDfile   Computed 3D by Vconf -m prep SDfile
Find this compound or compounds like it in BindingDB:
Activity Spreadsheet -- Enzyme Inhibition Constant Data from BindingDB
Found 1 hit for monomerid = 259959
TargetHepatocyte growth factor receptor(Homo sapiens (Human))
Jiangsu Hansoh Pharmaceutical
US Patent
LigandPNGBDBM259959(US9512121, 43)
Affinity DataIC50:  462nMT: 2°C. Assay description: Experimental Purpose: The purpose is to study the effect of the compounds on c-MET tyrosine kinase activity at the molecular level. IC50 values were ...
Ligand InfoPC cidPC sid
In DepthDetails US Patent