BDBM261482 US10011568, Ex. No. 5::US9708266, 5
SMILES CN(C(=O)C(C)(CO)c1cc(cc(c1)C(F)(F)F)C(F)(F)F)c1cnc(cc1-c1ccc(F)cc1C)C1CCC(CC(O)=O)CC1
InChI Key InChIKey=OBEGDBPDOHMKKI-UHFFFAOYSA-N
Data  4 IC50
  Tab Delimited (TSV)   2D SDfile   Computed 3D by Vconf -m prep SDfile
Find this compound or compounds like it in BindingDB:
Activity Spreadsheet -- Enzyme Inhibition Constant Data from BindingDB
Found 4 hits for monomerid = 261482
TargetSubstance-P receptor(Homo sapiens (Human))
Kissei Pharmaceutical
US Patent
LigandPNGBDBM261482(US10011568, Ex. No. 5 | US9708266, 5)
Affinity DataIC50:  0.980nMpH: 7.4 T: 2°C. Assay description: The buffer solution for the receptor binding test was dispensed to the wells of a 96-well assay plate (Greiner) at 22.5 μL/well. DMSO solutions ...
Ligand InfoPC cidPC sid
In DepthDetails US Patent
TargetCytochrome P450 3A4(Homo sapiens (Human))
Kissei Pharmaceutical
US Patent
LigandPNGBDBM261482(US10011568, Ex. No. 5 | US9708266, 5)
Affinity DataIC50:  1.30E+4nM. Assay description: A dimethyl sulfoxide (DMSO) solution of a test compound with a concentration 1000 times higher than the evaluation concentration was prepared, and a ...
Ligand InfoPC cidPC sid
In DepthDetails US Patent
TargetSubstance-P receptor(Homo sapiens (Human))
Kissei Pharmaceutical
US Patent
LigandPNGBDBM261482(US10011568, Ex. No. 5 | US9708266, 5)
Affinity DataIC50:  0.980nM. Assay description: The buffer solution for the receptor binding test was dispensed to the wells of a 96-well assay plate (Greiner) at 22.5 μL/well. DMSO solutions ...
Ligand InfoPC cidPC sid
In DepthDetails US Patent
TargetCytochrome P450 3A4(Homo sapiens (Human))
Kissei Pharmaceutical
US Patent
LigandPNGBDBM261482(US10011568, Ex. No. 5 | US9708266, 5)
Affinity DataIC50:  1.30E+4nMpH: 7.4 T: 2°C. Assay description: A dimethyl sulfoxide (DMSO) solution of a test compound with a concentration 1000 times higher than the evaluation concentration was prepared, and a ...
Ligand InfoPC cidPC sid
In DepthDetails US Patent