BDBM263216 US9708370, DBG-253-9
SMILES C[C@H](NC(=O)N(Cc1ccccc1)NC(=O)[C@@H](N)Cc1cnc[nH]1)C(=O)N[C@@H](Cc1c[nH]c2ccccc12)C(=O)N[C@H](Cc1ccccc1)C(=O)N[C@@H](CCCCN)C(N)=O
InChI Key
Data  1 IC50  1 EC50
  Tab Delimited (TSV)   2D SDfile   Computed 3D by Vconf -m prep SDfile
Find this compound or compounds like it in BindingDB:
Activity Spreadsheet -- Enzyme Inhibition Constant Data from BindingDB
Found 2 hits for monomerid = 263216
TargetEstrogen receptor [D538G](Homo sapiens (Human))
Valorisation-Recherche, Limited Partnership
US Patent
LigandPNGBDBM263216(US9708370, DBG-253-9)
Affinity DataEC50:  1.61E+4nM. Assay description: GHS-R1a radioreceptor assay using LLCPK-1 membranes overexpressing GSH-R1a and radioiodinated (1-28) rat ghrelin as tracer.
Ligand InfoPC cidPC sid
In DepthDetails US Patent
TargetPlatelet glycoprotein 4(Rattus norvegicus)
Valorisation-Recherche, Limited Partnership
US Patent
LigandPNGBDBM263216(US9708370, DBG-253-9)
Affinity DataIC50:  7.24E+4nMpH: 7.3Assay Description:Competition experiments were performed by incubating 50 μg of LLC-PK1 membranes expressing human GHS-R1a with 15 fmol of 125I-Ghrelin and increa...
Ligand InfoPC cidPC sid
In DepthDetails US Patent