BDBM263255 US9708370, 66 ZS554-F29::US9708370, ZS554-F29
SMILES C[C@H](NC(=O)[C@@H](Cc1c[nH]c2ccccc12)NC(=O)[C@@H](N)Cc1ccccc1)C(=O)NN(Cc1ccc(O)cc1)C(=O)N[C@H](Cc1ccccc1)C(=O)N[C@@H](CCCCN)C(N)=O
InChI Key
Data  2 IC50
  Tab Delimited (TSV)   2D SDfile   Computed 3D by Vconf -m prep SDfile
Find this compound or compounds like it in BindingDB:
Activity Spreadsheet -- Enzyme Inhibition Constant Data from BindingDB
Found 2 hits for monomerid = 263255
TargetPlatelet glycoprotein 4(Rattus norvegicus)
Valorisation-Recherche, Limited Partnership
US Patent
LigandPNGBDBM263255(US9708370, 66 ZS554-F29 | US9708370, ZS554-F29)
Affinity DataIC50:  1.18E+4nMpH: 7.3Assay Description:Competition experiments were performed by incubating 50 μg of LLC-PK1 membranes expressing human GHS-R1a with 15 fmol of 125I-Ghrelin and increa...
Ligand InfoPC cidPC sid
In DepthDetails US Patent
TargetEstrogen receptor [D538G](Homo sapiens (Human))
Valorisation-Recherche, Limited Partnership
US Patent
LigandPNGBDBM263255(US9708370, 66 ZS554-F29 | US9708370, ZS554-F29)
Affinity DataIC50:  1.00E+4nM. Assay description: GHS-R1a radioreceptor assay using LLCPK-1 membranes overexpressing GSH-R1a and radioiodinated (1-28) rat ghrelin as tracer.
Ligand InfoPC cidPC sid
In DepthDetails US Patent