BDBM26357 3-chloroindole compound, 18::methyl (2Z)-3-[(3-chloro-1H-indol-7-yl)amino]-2-cyano-3-{[(3S)-2-oxo-1-[2-oxo-2-(pyrrolidin-1-yl)ethyl]azepan-3-yl]amino}prop-2-enoate
SMILES COC(=O)C(C#N)C(N[C@H]1CCCCN(CC(=O)N2CCCC2)C1=O)=Nc1cccc2c(Cl)c[nH]c12
InChI Key InChIKey=SKFZGPKSPUYPLJ-OZBJMMHXSA-N
Data  1 IC50
PDB links: 1 PDB ID matches this monomer.
  Tab Delimited (TSV)   2D SDfile   Computed 3D by Vconf -m prep SDfile
Find this compound or compounds like it in BindingDB:
Activity Spreadsheet -- Enzyme Inhibition Constant Data from BindingDB
Found 1 hit for monomerid = 26357
TargetCoagulation factor X(Homo sapiens (Human))
Bristol-Myers Squibb
LigandPNGBDBM26357(3-chloroindole compound, 18 | methyl (2Z)-3-[(3-ch...)
Affinity DataIC50:  8.90nMpH: 7.4 T: 2°C. Assay description: Time-dependent optical density change was followed at 405 nm using a kinetic microplate reader at room temperature. Enzyme activity in the presence o...