BDBM264180 (2R)-2-(4-ethylpiperazin- 1-yl)-N-(3-{5-fluoro-2- [(3-methoxy-1-methyl-1H- pyrazol-4-yl)amino] pyrimidin-4-yl}-1H-indol- 7-yl)propanamide::US10167276, Example 4::US10654835, Example 4::US11247983, Example 4::US9714236, 4
SMILES CCN1CCN(CC1)[C@H](C)C(=O)Nc1cccc2c(c[nH]c12)-c1nc(Nc2cn(C)nc2OC)ncc1F
InChI Key
Data  12 IC50
  Tab Delimited (TSV)   2D SDfile   Computed 3D by Vconf -m prep SDfile
Find this compound or compounds like it in BindingDB:
Activity Spreadsheet -- Enzyme Inhibition Constant Data from BindingDB
Found 12 hits for monomerid = 264180
TargetTyrosine-protein kinase JAK1 [866-1154](Homo sapiens (Human))
Astrazeneca
US Patent
LigandPNGBDBM264180((2R)-2-(4-ethylpiperazin- 1-yl)-N-(3-{5-fluoro-2- ...)
Affinity DataIC50:  43nMpH: 7.3Assay Description:Enzyme inhibition studies were performed using recombinant JAK1 (amino acids 866-1154, Life Technologies, #PV4774, Carlsbad, Calif.), JAK2 (amino aci...
Ligand InfoPC cidPC sid
In DepthDetails US Patent
TargetTyrosine-protein kinase JAK2 [831-1132](Homo sapiens (Human))
Astrazeneca
US Patent
LigandPNGBDBM264180((2R)-2-(4-ethylpiperazin- 1-yl)-N-(3-{5-fluoro-2- ...)
Affinity DataIC50:  6.57E+3nMpH: 7.3Assay Description:Enzyme inhibition studies were performed using recombinant JAK1 (amino acids 866-1154, Life Technologies, #PV4774, Carlsbad, Calif.), JAK2 (amino aci...
Ligand InfoPC cidPC sid
In DepthDetails US Patent
TargetTyrosine-protein kinase JAK3 [781-1124](Homo sapiens (Human))
Astrazeneca
US Patent
LigandPNGBDBM264180((2R)-2-(4-ethylpiperazin- 1-yl)-N-(3-{5-fluoro-2- ...)
Affinity DataIC50: >3.00E+4nMpH: 7.3Assay Description:Enzyme inhibition studies were performed using recombinant JAK1 (amino acids 866-1154, Life Technologies, #PV4774, Carlsbad, Calif.), JAK2 (amino aci...
Ligand InfoPC cidPC sid
In DepthDetails US Patent
TargetTyrosine-protein kinase JAK1 [866-1154](Homo sapiens (Human))
Astrazeneca
US Patent
LigandPNGBDBM264180((2R)-2-(4-ethylpiperazin- 1-yl)-N-(3-{5-fluoro-2- ...)
Affinity DataIC50:  43nM. Assay description: Enzyme inhibition studies were performed using recombinant JAK1 (amino acids 866-1154, Life Technologies, #PV4774, Carlsbad, Calif.), JAK2 (amino aci...
Ligand InfoPC cidPC sid
In DepthDetails US Patent
TargetTyrosine-protein kinase JAK2 [808-1132](Homo sapiens (Human))
Dizal (Jiangsu) Pharmaceutical
US Patent
LigandPNGBDBM264180((2R)-2-(4-ethylpiperazin- 1-yl)-N-(3-{5-fluoro-2- ...)
Affinity DataIC50:  6.57E+3nM. Assay description: Enzyme inhibition studies were performed using recombinant JAK1 (amino acids 866-1154, Life Technologies, #PV4774, Carlsbad, Calif.), JAK2 (amino aci...
Ligand InfoPC cidPC sid
In DepthDetails US Patent
TargetTyrosine-protein kinase JAK3 [781-1124](Homo sapiens (Human))
Astrazeneca
US Patent
LigandPNGBDBM264180((2R)-2-(4-ethylpiperazin- 1-yl)-N-(3-{5-fluoro-2- ...)
Affinity DataIC50: >3.00E+4nM. Assay description: Enzyme inhibition studies were performed using recombinant JAK1 (amino acids 866-1154, Life Technologies, #PV4774, Carlsbad, Calif.), JAK2 (amino aci...
Ligand InfoPC cidPC sid
In DepthDetails US Patent
TargetTyrosine-protein kinase JAK1 [866-1154](Homo sapiens (Human))
Astrazeneca
US Patent
LigandPNGBDBM264180((2R)-2-(4-ethylpiperazin- 1-yl)-N-(3-{5-fluoro-2- ...)
Affinity DataIC50:  43nM. Assay description: Enzyme inhibition studies were performed using recombinant JAK1 (amino acids 866-1154, Life Technologies, PV4774, Carlsbad, Calif.), JAK2 (amino acid...
Ligand InfoPC cidPC sid
In DepthDetails US Patent
TargetTyrosine-protein kinase JAK2 [831-1132](Homo sapiens (Human))
Astrazeneca
US Patent
LigandPNGBDBM264180((2R)-2-(4-ethylpiperazin- 1-yl)-N-(3-{5-fluoro-2- ...)
Affinity DataIC50:  6.57E+3nM. Assay description: Enzyme inhibition studies were performed using recombinant JAK1 (amino acids 866-1154, Life Technologies, PV4774, Carlsbad, Calif.), JAK2 (amino acid...
Ligand InfoPC cidPC sid
In DepthDetails US Patent
TargetTyrosine-protein kinase JAK3 [781-1124](Homo sapiens (Human))
Astrazeneca
US Patent
LigandPNGBDBM264180((2R)-2-(4-ethylpiperazin- 1-yl)-N-(3-{5-fluoro-2- ...)
Affinity DataIC50: >3.00E+4nM. Assay description: Enzyme inhibition studies were performed using recombinant JAK1 (amino acids 866-1154, Life Technologies, PV4774, Carlsbad, Calif.), JAK2 (amino acid...
Ligand InfoPC cidPC sid
In DepthDetails US Patent
TargetTyrosine-protein kinase JAK1 [866-1154](Homo sapiens (Human))
Astrazeneca
US Patent
LigandPNGBDBM264180((2R)-2-(4-ethylpiperazin- 1-yl)-N-(3-{5-fluoro-2- ...)
Affinity DataIC50:  43nM. Assay description: Enzyme inhibition studies were performed using recombinant JAK1 (amino acids 866-1154, Life Technologies, #PV4774, Carlsbad, Calif.), JAK2 (amino aci...
Ligand InfoPC cidPC sid
In DepthDetails US Patent
TargetTyrosine-protein kinase JAK2 [831-1132](Homo sapiens (Human))
Astrazeneca
US Patent
LigandPNGBDBM264180((2R)-2-(4-ethylpiperazin- 1-yl)-N-(3-{5-fluoro-2- ...)
Affinity DataIC50:  6.57E+3nM. Assay description: Enzyme inhibition studies were performed using recombinant JAK1 (amino acids 866-1154, Life Technologies, #PV4774, Carlsbad, Calif.), JAK2 (amino aci...
Ligand InfoPC cidPC sid
In DepthDetails US Patent
TargetTyrosine-protein kinase JAK3 [811-1124](Homo sapiens (Human))
Dizal (Jiangsu) Pharmaceutical
US Patent
LigandPNGBDBM264180((2R)-2-(4-ethylpiperazin- 1-yl)-N-(3-{5-fluoro-2- ...)
Affinity DataIC50: >3.00E+4nM. Assay description: Enzyme inhibition studies were performed using recombinant JAK1 (amino acids 866-1154, Life Technologies, #PV4774, Carlsbad, Calif.), JAK2 (amino aci...
Ligand InfoPC cidPC sid
In DepthDetails US Patent