BDBM264216 (2R)-N-(3-{5-chloro- 2-[(3-methoxy-1- methyl-1H-pyrazol-4- yl)amino]pyrimidin-4- yl}-1H-indol-7-yl)-2- (4-methylpiperazin-1- yl)propanamide::US10167276, Example 36::US10654835, Example 36::US11247983, Example 36::US9714236, 36
SMILES COc1nn(C)cc1Nc1ncc(Cl)c(n1)-c1c[nH]c2c(NC(=O)[C@@H](C)N3CCN(C)CC3)cccc12
InChI Key
Data  20 IC50
  Tab Delimited (TSV)   2D SDfile   Computed 3D by Vconf -m prep SDfile
Find this compound or compounds like it in BindingDB:
Activity Spreadsheet -- Enzyme Inhibition Constant Data from BindingDB
Found 20 hits for monomerid = 264216
TargetTyrosine-protein kinase JAK1 [866-1154](Homo sapiens (Human))
Astrazeneca
US Patent
LigandPNGBDBM264216((2R)-N-(3-{5-chloro- 2-[(3-methoxy-1- methyl-1H-py...)
Affinity DataIC50:  7nMpH: 7.3Assay Description:Enzyme inhibition studies were performed using recombinant JAK1 (amino acids 866-1154, Life Technologies, #PV4774, Carlsbad, Calif.), JAK2 (amino aci...
Ligand InfoPC cidPC sid
In DepthDetails US Patent
TargetTyrosine-protein kinase JAK3 [781-1124](Homo sapiens (Human))
Dizal (Jiangsu) Pharmaceutical
US Patent
LigandPNGBDBM264216((2R)-N-(3-{5-chloro- 2-[(3-methoxy-1- methyl-1H-py...)
Affinity DataIC50:  1.91E+4nM. Assay description: Enzyme inhibition studies were performed using recombinant JAK1 (amino acids 866-1154, Life Technologies, #PV4774, Carlsbad, Calif.), JAK2 (amino aci...
Ligand InfoPC cidPC sid
In DepthDetails US Patent
TargetTyrosine-protein kinase JAK3 [781-1124](Homo sapiens (Human))
Dizal (Jiangsu) Pharmaceutical
US Patent
LigandPNGBDBM264216((2R)-N-(3-{5-chloro- 2-[(3-methoxy-1- methyl-1H-py...)
Affinity DataIC50:  1.91E+4nMpH: 7.3Assay Description:Enzyme inhibition studies were performed using recombinant JAK1 (amino acids 866-1154, Life Technologies, #PV4774, Carlsbad, Calif.), JAK2 (amino aci...
Ligand InfoPC cidPC sid
In DepthDetails US Patent
TargetTyrosine-protein kinase JAK1 [866-1154](Homo sapiens (Human))
Astrazeneca
US Patent
LigandPNGBDBM264216((2R)-N-(3-{5-chloro- 2-[(3-methoxy-1- methyl-1H-py...)
Affinity DataIC50:  7nM. Assay description: Enzyme inhibition studies were performed using recombinant JAK1 (amino acids 866-1154, Life Technologies, #PV4774, Carlsbad, Calif.), JAK2 (amino aci...
Ligand InfoPC cidPC sid
In DepthDetails US Patent
TargetTyrosine-protein kinase JAK2 [808-1132](Homo sapiens (Human))
Dizal (Jiangsu) Pharmaceutical
US Patent
LigandPNGBDBM264216((2R)-N-(3-{5-chloro- 2-[(3-methoxy-1- methyl-1H-py...)
Affinity DataIC50:  1.76E+3nM. Assay description: Enzyme inhibition studies were performed using recombinant JAK1 (amino acids 866-1154, Life Technologies, #PV4774, Carlsbad, Calif.), JAK2 (amino aci...
Ligand InfoPC cidPC sid
In DepthDetails US Patent
TargetTyrosine-protein kinase JAK3 [811-1124](Homo sapiens (Human))
Dizal (Jiangsu) Pharmaceutical
US Patent
LigandPNGBDBM264216((2R)-N-(3-{5-chloro- 2-[(3-methoxy-1- methyl-1H-py...)
Affinity DataIC50:  1.91E+4nM. Assay description: Enzyme inhibition studies were performed using recombinant JAK1 (amino acids 866-1154, Life Technologies, #PV4774, Carlsbad, Calif.), JAK2 (amino aci...
Ligand InfoPC cidPC sid
In DepthDetails US Patent
TargetTyrosine-protein kinase JAK3(Homo sapiens (Human))
Therachem Research Medilab (India)
Curated by ChEMBL
LigandPNGBDBM264216((2R)-N-(3-{5-chloro- 2-[(3-methoxy-1- methyl-1H-py...)
Affinity DataIC50:  1.91E+4nM. Assay description: Inhibition of N-terminal GST fused recombinant JAK3 (781 to 1124 amino acids) (unknown origin) expressed in insect cells using ATP and peptide substr...
Ligand InfoPC cidPC sid
In DepthDetails ArticlePubMed
TargetTyrosine-protein kinase JAK2(Homo sapiens (Human))
Therachem Research Medilab (India)
Curated by ChEMBL
LigandPNGBDBM264216((2R)-N-(3-{5-chloro- 2-[(3-methoxy-1- methyl-1H-py...)
Affinity DataIC50:  1.76E+3nM. Assay description: Inhibition of N-terminal GST fused recombinant JAK2 (831 to 1132 amino acids) (unknown origin) expressed in insect cells using ATP and peptide substr...
Ligand InfoPC cidPC sid
In DepthDetails ArticlePubMed
TargetTyrosine-protein kinase JAK1(Homo sapiens (Human))
Therachem Research Medilab (India)
Curated by ChEMBL
LigandPNGBDBM264216((2R)-N-(3-{5-chloro- 2-[(3-methoxy-1- methyl-1H-py...)
Affinity DataIC50:  58nM. Assay description: Inhibition of JAK1 in human NCI-H1975 cells assessed as reduction in STAT3 phosphorylation incubated for 2 hrs
Ligand InfoPC cidPC sid
In DepthDetails ArticlePubMed
TargetTyrosine-protein kinase JAK1(Homo sapiens (Human))
Therachem Research Medilab (India)
Curated by ChEMBL
LigandPNGBDBM264216((2R)-N-(3-{5-chloro- 2-[(3-methoxy-1- methyl-1H-py...)
Affinity DataIC50:  7nM. Assay description: Inhibition of N-terminal GST fused human recombinant JAK1 (866 to 1154 amino acids) expressed in insect cells using ATP and peptide substrate (FITC-C...
Ligand InfoPC cidPC sid
In DepthDetails ArticlePubMed
TargetTyrosine-protein kinase JAK1 [866-1154](Homo sapiens (Human))
Astrazeneca
US Patent
LigandPNGBDBM264216((2R)-N-(3-{5-chloro- 2-[(3-methoxy-1- methyl-1H-py...)
Affinity DataIC50:  7nM. Assay description: Enzyme inhibition studies were performed using recombinant JAK1 (amino acids 866-1154, Life Technologies, PV4774, Carlsbad, Calif.), JAK2 (amino acid...
Ligand InfoPC cidPC sid
In DepthDetails US Patent
TargetTyrosine-protein kinase JAK2 [831-1132](Homo sapiens (Human))
Dizal (Jiangsu) Pharmaceutical
US Patent
LigandPNGBDBM264216((2R)-N-(3-{5-chloro- 2-[(3-methoxy-1- methyl-1H-py...)
Affinity DataIC50:  1.76E+3nM. Assay description: Enzyme inhibition studies were performed using recombinant JAK1 (amino acids 866-1154, Life Technologies, PV4774, Carlsbad, Calif.), JAK2 (amino acid...
Ligand InfoPC cidPC sid
In DepthDetails US Patent
TargetTyrosine-protein kinase JAK3 [781-1124](Homo sapiens (Human))
Dizal (Jiangsu) Pharmaceutical
US Patent
LigandPNGBDBM264216((2R)-N-(3-{5-chloro- 2-[(3-methoxy-1- methyl-1H-py...)
Affinity DataIC50:  1.91E+4nM. Assay description: Enzyme inhibition studies were performed using recombinant JAK1 (amino acids 866-1154, Life Technologies, PV4774, Carlsbad, Calif.), JAK2 (amino acid...
Ligand InfoPC cidPC sid
In DepthDetails US Patent
TargetTyrosine-protein kinase JAK1(Homo sapiens (Human))
Therachem Research Medilab (India)
Curated by ChEMBL
LigandPNGBDBM264216((2R)-N-(3-{5-chloro- 2-[(3-methoxy-1- methyl-1H-py...)
Affinity DataIC50:  7nM. Assay description: Inhibition of recombinant human N-terminal GST-tagged JAK1 (866 to 1154 residues) expressed in insect cells using FITC-labeled C6-KKHTDDGYMPMSPGVA-NH...
Ligand InfoPC cidPC sid
In DepthDetails ArticlePubMed
TargetTyrosine-protein kinase JAK1(Homo sapiens (Human))
Therachem Research Medilab (India)
Curated by ChEMBL
LigandPNGBDBM264216((2R)-N-(3-{5-chloro- 2-[(3-methoxy-1- methyl-1H-py...)
Affinity DataIC50:  60nM. Assay description: Inhibition of JAK1 in human NCI-H1975 cells assessed as decrease in STAT3 phosphorylation measured after 1 hr by ELISA
Ligand InfoPC cidPC sid
In DepthDetails ArticlePubMed
TargetPotassium voltage-gated channel subfamily H member 2(Homo sapiens (Human))
Astrazeneca
Curated by ChEMBL
LigandPNGBDBM264216((2R)-N-(3-{5-chloro- 2-[(3-methoxy-1- methyl-1H-py...)
Affinity DataIC50:  2.20E+4nM. Assay description: Inhibition of human ERG
Ligand InfoPC cidPC sid
In DepthDetails ArticlePubMed
TargetTyrosine-protein kinase JAK2(Homo sapiens (Human))
Therachem Research Medilab (India)
Curated by ChEMBL
LigandPNGBDBM264216((2R)-N-(3-{5-chloro- 2-[(3-methoxy-1- methyl-1H-py...)
Affinity DataIC50:  1.80E+3nM. Assay description: Inhibition of recombinant human N-terminal GST-tagged JAK2 (831 to 1132 residues) expressed in insect cells using 5FAM-labeled GEEPLYWSFPAKKK-NH2 pep...
Ligand InfoPC cidPC sid
In DepthDetails ArticlePubMed
TargetTyrosine-protein kinase JAK1 [866-1154](Homo sapiens (Human))
Astrazeneca
US Patent
LigandPNGBDBM264216((2R)-N-(3-{5-chloro- 2-[(3-methoxy-1- methyl-1H-py...)
Affinity DataIC50:  7nM. Assay description: Enzyme inhibition studies were performed using recombinant JAK1 (amino acids 866-1154, Life Technologies, #PV4774, Carlsbad, Calif.), JAK2 (amino aci...
Ligand InfoPC cidPC sid
In DepthDetails US Patent
TargetTyrosine-protein kinase JAK2 [831-1132](Homo sapiens (Human))
Dizal (Jiangsu) Pharmaceutical
US Patent
LigandPNGBDBM264216((2R)-N-(3-{5-chloro- 2-[(3-methoxy-1- methyl-1H-py...)
Affinity DataIC50:  1.76E+3nM. Assay description: Enzyme inhibition studies were performed using recombinant JAK1 (amino acids 866-1154, Life Technologies, #PV4774, Carlsbad, Calif.), JAK2 (amino aci...
Ligand InfoPC cidPC sid
In DepthDetails US Patent
TargetTyrosine-protein kinase JAK2 [831-1132](Homo sapiens (Human))
Dizal (Jiangsu) Pharmaceutical
US Patent
LigandPNGBDBM264216((2R)-N-(3-{5-chloro- 2-[(3-methoxy-1- methyl-1H-py...)
Affinity DataIC50:  1.76E+3nMpH: 7.3Assay Description:Enzyme inhibition studies were performed using recombinant JAK1 (amino acids 866-1154, Life Technologies, #PV4774, Carlsbad, Calif.), JAK2 (amino aci...
Ligand InfoPC cidPC sid
In DepthDetails US Patent