BDBM264244 (2R)-N-(3-{2-[(3- ethoxy-1-methyl-1H- pyrazol-4-yl)amino]-5- methylpyrimidin-4-yl}- 1H-indol-7-yl)-3-methoxy- 2-(4-methylpiperazin-1- yl)propanamide::US9714236, 64
SMILES CCOc1nn(C)cc1Nc1cnc(C)c(n1)-c1c[nH]c2c(NC(=O)[C@@H](COC)N3CCN(C)CC3)cccc12
InChI Key InChIKey=YBBYFCSBODLGRP-HSZRJFAPSA-N
Data  3 IC50
  Tab Delimited (TSV)   2D SDfile   Computed 3D by Vconf -m prep SDfile
Find this compound or compounds like it in BindingDB:
Activity Spreadsheet -- Enzyme Inhibition Constant Data from BindingDB
Found 3 hits for monomerid = 264244
TargetTyrosine-protein kinase JAK1 [866-1154](Homo sapiens (Human))
Astrazeneca
US Patent
LigandPNGBDBM264244((2R)-N-(3-{2-[(3- ethoxy-1-methyl-1H- pyrazol-4-yl...)
Affinity DataIC50: <5nMpH: 7.3Assay Description:Enzyme inhibition studies were performed using recombinant JAK1 (amino acids 866-1154, Life Technologies, #PV4774, Carlsbad, Calif.), JAK2 (amino aci...
Ligand InfoPC cidPC sid
In DepthDetails US Patent
TargetTyrosine-protein kinase JAK3 [781-1124](Homo sapiens (Human))
Astrazeneca
US Patent
LigandPNGBDBM264244((2R)-N-(3-{2-[(3- ethoxy-1-methyl-1H- pyrazol-4-yl...)
Affinity DataIC50: >3.00E+4nMpH: 7.3Assay Description:Enzyme inhibition studies were performed using recombinant JAK1 (amino acids 866-1154, Life Technologies, #PV4774, Carlsbad, Calif.), JAK2 (amino aci...
Ligand InfoPC cidPC sid
In DepthDetails US Patent
TargetTyrosine-protein kinase JAK2 [831-1132](Homo sapiens (Human))
Astrazeneca
US Patent
LigandPNGBDBM264244((2R)-N-(3-{2-[(3- ethoxy-1-methyl-1H- pyrazol-4-yl...)
Affinity DataIC50:  2.04E+3nMpH: 7.3Assay Description:Enzyme inhibition studies were performed using recombinant JAK1 (amino acids 866-1154, Life Technologies, #PV4774, Carlsbad, Calif.), JAK2 (amino aci...
Ligand InfoPC cidPC sid
In DepthDetails US Patent