BDBM264485 17-iodooestra-1,3,5(10),16-tetraene-3-carboxamide::US9714266, 14
SMILES [H][C@@]12CC=C(I)[C@@]1(C)CC[C@]1([H])c3ccc(cc3CC[C@@]21[H])C(N)=O
InChI Key InChIKey=BKEIXZZMXZSLRG-JEWRLFTDSA-N
Data  1 IC50
  Tab Delimited (TSV)   2D SDfile   Computed 3D by Vconf -m prep SDfile
Find this compound or compounds like it in BindingDB:
Activity Spreadsheet -- Enzyme Inhibition Constant Data from BindingDB
Found 1 hit for monomerid = 264485
TargetAldo-keto reductase family 1 member C3(Homo sapiens (Human))
Bayer Pharma Aktiengesellschaft
US Patent
LigandPNGBDBM264485(17-iodooestra-1,3,5(10),16-tetraene-3-carboxamide ...)
Affinity DataIC50:  54nMpH: 7.0Assay Description:For the assay, 50 nl of a 100-fold concentrated solution of the test substance in DMSO were pipetted into a black low-volume 384-well microtitre plat...
Ligand InfoPC cidPC sid
In DepthDetails US Patent