BDBM267137 N-{2-[4-(benzyloxy)piperidin-1-yl]-2-(1,3-thiazol-5-yl)ethyl}-2,6-dimethylbenzamide::US10167281, Compound 23::US9718812, 23
SMILES Cc1cccc(C)c1C(=O)NCC(N1CCC(CC1)OCc1ccccc1)c1cncs1
InChI Key InChIKey=CHHIHKUGEXITLH-UHFFFAOYSA-N
Data  4 IC50
  Tab Delimited (TSV)   2D SDfile   Computed 3D by Vconf -m prep SDfile
Find this compound or compounds like it in BindingDB:
Activity Spreadsheet -- Enzyme Inhibition Constant Data from BindingDB
Found 4 hits for monomerid = 267137
TargetP2X purinoceptor 7(Homo sapiens (Human))
Axxam
US Patent
LigandPNGBDBM267137(N-{2-[4-(benzyloxy)piperidin-1-yl]-2-(1,3-thiazol-...)
Affinity DataIC50:  118nM. Assay description: Extracellular binding of Bz-ATP to P2X7 receptor opens the channel and allows Ca2+ influx into the cells. This Ca2+ entry was measured in HEK-293 cel...
Ligand InfoPC cidPC sid
In DepthDetails US Patent
TargetP2X purinoceptor 7(Homo sapiens (Human))
Axxam
US Patent
LigandPNGBDBM267137(N-{2-[4-(benzyloxy)piperidin-1-yl]-2-(1,3-thiazol-...)
Affinity DataIC50:  40nM. Assay description: YO-PROŽ-1 is a fluorescent DNA-binding dye with a MW of 374 Da (Molecular Probes, cat. Y3603). This method is based upon the presumed ability of YO-P...
Ligand InfoPC cidPC sid
In DepthDetails US Patent
TargetP2X purinoceptor 7(Homo sapiens (Human))
Axxam
US Patent
LigandPNGBDBM267137(N-{2-[4-(benzyloxy)piperidin-1-yl]-2-(1,3-thiazol-...)
Affinity DataIC50:  118nM. Assay description: Extracellular binding of Bz-ATP to P2X7 receptor opens the channel and allows Ca2+ influx into the cells. This Ca2+ entry was measured in HEK-293 cel...
Ligand InfoPC cidPC sid
In DepthDetails US Patent
TargetP2X purinoceptor 7(Homo sapiens (Human))
Axxam
US Patent
LigandPNGBDBM267137(N-{2-[4-(benzyloxy)piperidin-1-yl]-2-(1,3-thiazol-...)
Affinity DataIC50:  40nM. Assay description: YO-PROŽ-1 is a fluorescent DNA-binding dye with a MW of 374 Da (Molecular Probes, cat. Y3603). This method is based upon the presumed ability of YO-P...
Ligand InfoPC cidPC sid
In DepthDetails US Patent