BDBM267151 2-chloro-N-[2-(4,4-difluoropiperidin-1-yl)-2-(4-methyl-1,3-thiazol-5-yl)ethyl]-6-fluorobenzamide::US10167281, Compound 31::US9718812, 31
SMILES Cc1ncsc1C(CNC(=O)c1c(F)cccc1Cl)N1CCC(F)(F)CC1
InChI Key InChIKey=CGYUQDKVSHVODV-UHFFFAOYSA-N
Data  4 IC50
  Tab Delimited (TSV)   2D SDfile   Computed 3D by Vconf -m prep SDfile
Find this compound or compounds like it in BindingDB:
Activity Spreadsheet -- Enzyme Inhibition Constant Data from BindingDB
Found 4 hits for monomerid = 267151
TargetP2X purinoceptor 7(Homo sapiens (Human))
Axxam
US Patent
LigandPNGBDBM267151(2-chloro-N-[2-(4,4-difluoropiperidin-1-yl)-2-(4-me...)
Affinity DataIC50:  31nM. Assay description: Extracellular binding of Bz-ATP to P2X7 receptor opens the channel and allows Ca2+ influx into the cells. This Ca2+ entry was measured in HEK-293 cel...
Ligand InfoPC cidPC sid
In DepthDetails US Patent
TargetP2X purinoceptor 7(Homo sapiens (Human))
Axxam
US Patent
LigandPNGBDBM267151(2-chloro-N-[2-(4,4-difluoropiperidin-1-yl)-2-(4-me...)
Affinity DataIC50:  229nM. Assay description: YO-PROŽ-1 is a fluorescent DNA-binding dye with a MW of 374 Da (Molecular Probes, cat. Y3603). This method is based upon the presumed ability of YO-P...
Ligand InfoPC cidPC sid
In DepthDetails US Patent
TargetP2X purinoceptor 7(Homo sapiens (Human))
Axxam
US Patent
LigandPNGBDBM267151(2-chloro-N-[2-(4,4-difluoropiperidin-1-yl)-2-(4-me...)
Affinity DataIC50:  31nM. Assay description: Extracellular binding of Bz-ATP to P2X7 receptor opens the channel and allows Ca2+ influx into the cells. This Ca2+ entry was measured in HEK-293 cel...
Ligand InfoPC cidPC sid
In DepthDetails US Patent
TargetP2X purinoceptor 7(Homo sapiens (Human))
Axxam
US Patent
LigandPNGBDBM267151(2-chloro-N-[2-(4,4-difluoropiperidin-1-yl)-2-(4-me...)
Affinity DataIC50:  229nM. Assay description: YO-PROŽ-1 is a fluorescent DNA-binding dye with a MW of 374 Da (Molecular Probes, cat. Y3603). This method is based upon the presumed ability of YO-P...
Ligand InfoPC cidPC sid
In DepthDetails US Patent