BDBM269693 (2S)—N-(4-(2,6-dimethoxyphenyl)-5-(3-pyridinyl)-4H-1,2,4-triazol-3-yl)-1-(5-fluoro-2-pyrimidinyl)-2-propanesulfonamide or (2R)—N-(4-(2,6-dimethoxyphenyl)-5-(3-pyridinyl)-4H-1,2,4-triazol-3-yl-1-(5-fluoro-2-pyrimidinyl)-2-propanesulfonamide::US10058550, Example 206.0
SMILES COc1cccc(OC)c1-n1c(NS(=O)(=O)[C@H](C)Cc2ncc(F)cn2)nnc1-c1cccnc1
InChI Key InChIKey=BGTXYBUAMCBKGR-CQSZACIVSA-N
Data  1 EC50
  Tab Delimited (TSV)   2D SDfile   Computed 3D by Vconf -m prep SDfile
Find this compound or compounds like it in BindingDB:
Activity Spreadsheet -- Enzyme Inhibition Constant Data from BindingDB
Found 1 hit for monomerid = 269693
TargetApelin receptor(Homo sapiens (Human))
Amgen
US Patent
LigandPNGBDBM269693((2S)—N-(4-(2,6-dimethoxyphenyl)-5-(3-pyridiny...)
Affinity DataEC50:  1.30nMpH: 7.5Assay Description:The human APJ receptor was cloned by polymerase chain reaction and the gene encoding the receptor was subcloned in pFLAG-CMV¿-3 expression vector (Si...
Ligand InfoPC cidPC sid
In DepthDetails US Patent