BDBM271093 US10071086, Compound 376
SMILES O=C(Nc1cncc(c1)-c1cnc2[nH]nc(-c3nc4c(cncc4[nH]3)-c3ccoc3)c2c1)c1ccccc1
InChI Key InChIKey=VFOGOBDGQIBPAQ-UHFFFAOYSA-N
Data  1 IC50
  Tab Delimited (TSV)   2D SDfile   Computed 3D by Vconf -m prep SDfile
Find this compound or compounds like it in BindingDB:
Activity Spreadsheet -- Enzyme Inhibition Constant Data from BindingDB
Found 1 hit for monomerid = 271093
TargetAdenomatous polyposis coli protein(Homo sapiens (Human))
Samumed
US Patent
LigandPNGBDBM271093(US10071086, Compound 376)
Affinity DataIC50:  51nM. Assay description: Reporter cell lines can be generated by stably transducing cells of cancer cell lines (e.g., colon cancer) with a lentiviral construct that include a...
Ligand InfoPC cidPC sid
In DepthDetails US Patent