BDBM271529 US10065941, Compound I-030::US9732060, Compound I-030
SMILES COC(=O)[C@@H](C)Cn1c(=O)[nH]\c(=N/c2ccc(Oc3ncccc3C(F)(F)F)cc2)n(Cc2ccc(Cl)cc2)c1=O
InChI Key
Data  2 IC50
  Tab Delimited (TSV)   2D SDfile   Computed 3D by Vconf -m prep SDfile
Find this compound or compounds like it in BindingDB:
Activity Spreadsheet -- Enzyme Inhibition Constant Data from BindingDB
Found 1 hit for monomerid = 271529
TargetP2X purinoceptor 3(Homo sapiens (Human))
Shionogi
US Patent
LigandPNGBDBM271529(US10065941, Compound I-030 | US9732060, Compound I...)
Affinity DataIC50:  176nMpH: 7.5Assay Description:Stably expressing cell line (C6BU-1 cell transfected with human P2X3 receptor gene (GenBank accession number Y07683) was used. The cells were seeded ...
Ligand InfoPC cidPC sid
In DepthDetails US Patent