BDBM273135 (R)-N-benzyl-1-{5-[difluoro(phenyl)methyl]-7-oxo-6,7-dihydro[1,3]thiazolo[5,4-d]pyrimidin-2-yl}pyrrolidine-2-carboxamide::US10065972, Example 524
SMILES FC(F)(c1ccccc1)c1nc2sc(nc2c(=O)[nH]1)N1CCC[C@@H]1C(=O)NCc1ccccc1
InChI Key
Data  1 IC50
  Tab Delimited (TSV)   2D SDfile   Computed 3D by Vconf -m prep SDfile
Find this compound or compounds like it in BindingDB:
Activity Spreadsheet -- Enzyme Inhibition Constant Data from BindingDB
Found 1 hit for monomerid = 273135
TargetKynurenine/alpha-aminoadipate aminotransferase, mitochondrial(Homo sapiens (Human))
Mitsubishi Tanabe Pharma
US Patent
LigandPNGBDBM273135((R)-N-benzyl-1-{5-[difluoro(phenyl)methyl]-7-oxo-6...)
Affinity DataIC50:  4nMpH: 8.0Assay Description:The inhibitory action of the test compound on human recombinant KAT-II was determined by the following method.To a reaction mixture (45 μL) cont...
Ligand InfoPC cidPC sid
In DepthDetails US Patent