BDBM273206 US10065973, Example 3-A
SMILES [H][C@@]1(CO)C[C@@]([H])(C(O)CC)[C@@H](O1)n1c2nc(N)[nH]c(=O)c2sc1=O
InChI Key InChIKey=JZSOMHPRUFTSRL-FMQNBGRISA-N
Data  1 EC50
  Tab Delimited (TSV)   2D SDfile   Computed 3D by Vconf -m prep SDfile
Find this compound or compounds like it in BindingDB:
Activity Spreadsheet -- Enzyme Inhibition Constant Data from BindingDB
Found 1 hit for monomerid = 273206
TargetToll-like receptor 7(Homo sapiens (Human))
Hoffmann-La Roche
US Patent
LigandPNGBDBM273206(US10065973, Example 3-A)
Affinity DataEC50:  1.11E+5nM. Assay description: HEK293-Blue-hTLR7 cells were incubated at a density of 250,000-450,000 cells/mL in a volume of 180 μL in a 96-well plate in Dulbecco's Modif...
Ligand InfoPC cidPC sid
In DepthDetails US Patent