BDBM273211 5-Amino-3-[(2R,3S,5S)-5-(hydroxymethyl)-3-(1-hydroxy-1-methyl-ethyl)tetrahydrofuran-2-yl]-6H-thiazolo[4,5-d]pyrimidine-2,7-dione::US10065973, Example 8
SMILES [H][C@@]1(CO)C[C@]([H])([C@@H](O1)n1c2nc(N)[nH]c(=O)c2sc1=O)C(C)(C)O
InChI Key InChIKey=PZSWYDBFDBYNKX-BAJZRUMYSA-N
Data  1 EC50
  Tab Delimited (TSV)   2D SDfile   Computed 3D by Vconf -m prep SDfile
Find this compound or compounds like it in BindingDB:
Activity Spreadsheet -- Enzyme Inhibition Constant Data from BindingDB
Found 1 hit for monomerid = 273211
TargetToll-like receptor 7(Homo sapiens (Human))
Hoffmann-La Roche
US Patent
LigandPNGBDBM273211(5-Amino-3-[(2R,3S,5S)-5-(hydroxymethyl)-3-(1-hydro...)
Affinity DataEC50:  2.30E+4nM. Assay description: HEK293-Blue-hTLR7 cells were incubated at a density of 250,000-450,000 cells/mL in a volume of 180 μL in a 96-well plate in Dulbecco's Modif...
Ligand InfoPC cidPC sid
In DepthDetails US Patent