BDBM273219 5-Amino-3-[(2R,3S,5S)-3-[(1R)-1-benzyloxyethyl]-5-[(1S)-1-hydroxypropyl]tetrahydrofuran-2-yl]-6H-thiazolo[4,5-d]pyrimidine-2,7-dione::US10065973, Example 14
SMILES [H][C@]1(C[C@@]([H])([C@@H](C)OCc2ccccc2)[C@@H](O1)n1c2nc(N)[nH]c(=O)c2sc1=O)[C@@H](O)CC
InChI Key InChIKey=FWWGSMYPKMIDAF-YQRWCPHRSA-N
Data  1 EC50
  Tab Delimited (TSV)   2D SDfile   Computed 3D by Vconf -m prep SDfile
Find this compound or compounds like it in BindingDB:
Activity Spreadsheet -- Enzyme Inhibition Constant Data from BindingDB
Found 1 hit for monomerid = 273219
TargetToll-like receptor 7(Homo sapiens (Human))
Hoffmann-La Roche
US Patent
LigandPNGBDBM273219(5-Amino-3-[(2R,3S,5S)-3-[(1R)-1-benzyloxyethyl]-5-...)
Affinity DataEC50:  6.00E+4nM. Assay description: HEK293-Blue-hTLR7 cells were incubated at a density of 250,000-450,000 cells/mL in a volume of 180 μL in a 96-well plate in Dulbecco's Modif...
Ligand InfoPC cidPC sid
In DepthDetails US Patent