BDBM273222 US10065973, Example 17::[(1S)-1-[(2S,4S,5R)-5-(5-Amino-2,7-dioxo-6H-thiazolo[4,5-d]pyrimidin-3-yl)-4-[(1R)-1-hydroxyethyl]tetrahydrofuran-2-yl]propyl] acetate
SMILES CC[C@H](OC(C)=O)[C@@H]1C[C@@H]([C@@H](C)O)[C@@H](O1)n1c2nc(N)[nH]c(=O)c2sc1=O
InChI Key
Data  1 EC50
  Tab Delimited (TSV)   2D SDfile   Computed 3D by Vconf -m prep SDfile
Find this compound or compounds like it in BindingDB:
Activity Spreadsheet -- Enzyme Inhibition Constant Data from BindingDB
Found 1 hit for monomerid = 273222
TargetToll-like receptor 7(Homo sapiens (Human))
Hoffmann-La Roche
US Patent
LigandPNGBDBM273222(US10065973, Example 17 | [(1S)-1-[(2S,4S,5R)-5-(5-...)
Affinity DataEC50:  1.50E+4nM. Assay description: HEK293-Blue-hTLR7 cells were incubated at a density of 250,000-450,000 cells/mL in a volume of 180 μL in a 96-well plate in Dulbecco's Modif...
Ligand InfoPC cidPC sid
In DepthDetails US Patent