BDBM274856 2,6-Difluoro-N-(6-(4- (4-fluorophenyl)-1- (tetrahydro-2H-pyran- 4-yl)-1H-imidazol-5- yl)imidazo[1,2-b]pyridazin-2- yl)isonicotinamide::US9556179, Compound 433
SMILES Fc1ccc(cc1)-c1ncn(C2CCOCC2)c1-c1ccc2nc(NC(=O)c3cc(F)nc(F)c3)cn2n1
InChI Key InChIKey=MZNCOQALBMVROH-UHFFFAOYSA-N
Data  2 IC50
  Tab Delimited (TSV)   2D SDfile   Computed 3D by Vconf -m prep SDfile
Find this compound or compounds like it in BindingDB:
Activity Spreadsheet -- Enzyme Inhibition Constant Data from BindingDB
Found 2 hits for monomerid = 274856
TargetCasein kinase I isoform delta(Homo sapiens (Human))
Bristol-Myers Squibb
US Patent
LigandPNGBDBM274856(2,6-Difluoro-N-(6-(4- (4-fluorophenyl)-1- (tetrahy...)
Affinity DataIC50:  0.200nMpH: 7.4 T: 2°C. Assay description: The kinase assay was performed in V-bottom 384-well plates. The final assay volume was 30 μl prepared from 15 μl additions of enzyme, subst...
Ligand InfoPC cidPC sid
In DepthDetails US Patent
TargetCasein kinase I isoform epsilon(Homo sapiens (Human))
Bristol-Myers Squibb
US Patent
LigandPNGBDBM274856(2,6-Difluoro-N-(6-(4- (4-fluorophenyl)-1- (tetrahy...)
Affinity DataIC50:  1.20nMpH: 7.4 T: 2°C. Assay description: The kinase assay was performed in V-bottom 384-well plates. The final assay volume was 30 μl prepared from 15 μl additions of enzyme, subst...
Ligand InfoPC cidPC sid
In DepthDetails US Patent