BDBM274900 2-Fluoro-N-(6-(2-(4-fluorophenyl)-7-(3,3,3-trifluoropropyl)-5,6,7,8-tetrahydroimidazo[1,2-a]pyrazin-3-yl)imidazo[1,2-b]pyridazin-2-yl)isonicotinamide::US9556179, Compound 478
SMILES Fc1ccc(cc1)-c1nc2CN(CCC(F)(F)F)CCn2c1-c1ccc2nc(NC(=O)c3ccnc(F)c3)cn2n1
InChI Key InChIKey=DFVHTAZZLSDYJW-UHFFFAOYSA-N
Data  2 IC50
  Tab Delimited (TSV)   2D SDfile   Computed 3D by Vconf -m prep SDfile
Find this compound or compounds like it in BindingDB:
Activity Spreadsheet -- Enzyme Inhibition Constant Data from BindingDB
Found 2 hits for monomerid = 274900
TargetCasein kinase I isoform delta(Homo sapiens (Human))
Bristol-Myers Squibb
US Patent
LigandPNGBDBM274900(2-Fluoro-N-(6-(2-(4-fluorophenyl)-7-(3,3,3-trifluo...)
Affinity DataIC50:  0.400nMpH: 7.4 T: 2°C. Assay description: The kinase assay was performed in V-bottom 384-well plates. The final assay volume was 30 μl prepared from 15 μl additions of enzyme, subst...
Ligand InfoPC cidPC sid
In DepthDetails US Patent
TargetCasein kinase I isoform epsilon(Homo sapiens (Human))
Bristol-Myers Squibb
US Patent
LigandPNGBDBM274900(2-Fluoro-N-(6-(2-(4-fluorophenyl)-7-(3,3,3-trifluo...)
Affinity DataIC50:  2.30nMpH: 7.4 T: 2°C. Assay description: The kinase assay was performed in V-bottom 384-well plates. The final assay volume was 30 μl prepared from 15 μl additions of enzyme, subst...
Ligand InfoPC cidPC sid
In DepthDetails US Patent