BDBM277983 2-((2S,4R)-4-hydroxy-2-methylpyrrolidin-1-yl)-5-(4-((4-(4-(oxetan-3-yl)piperazin-1-yl)phenyl)amino)-1,3,5-triazin-2-yl)benzonitrile::US10040781, Example 205::US10253019, Example 205
SMILES C[C@H]1C[C@@H](O)CN1c1ccc(cc1C#N)-c1ncnc(Nc2ccc(cc2)N2CCN(CC2)C2COC2)n1
InChI Key InChIKey=IYOHUZINNTYJDG-UQBPGWFLSA-N
Data  6 IC50
  Tab Delimited (TSV)   2D SDfile   Computed 3D by Vconf -m prep SDfile
Find this compound or compounds like it in BindingDB:
Activity Spreadsheet -- Enzyme Inhibition Constant Data from BindingDB
Found 6 hits for monomerid = 277983
TargetSerine/threonine-protein kinase TBK1(Homo sapiens (Human))
Gilead Sciences
US Patent
LigandPNGBDBM277983(2-((2S,4R)-4-hydroxy-2-methylpyrrolidin-1-yl)-5-(4...)
Affinity DataIC50:  1.00E+3nMpH: 7.0Assay Description:Enzymatic activity of IKKε and TBK1 was measured using a homogeneous time resolved fluorescence resonance energy transfer (TR-FRET) assay that m...
Ligand InfoPC cidPC sid
In DepthDetails US Patent
TargetInhibitor of nuclear factor kappa-B kinase subunit epsilon(Homo sapiens (Human))
Gilead Sciences
US Patent
LigandPNGBDBM277983(2-((2S,4R)-4-hydroxy-2-methylpyrrolidin-1-yl)-5-(4...)
Affinity DataIC50:  1.70E+4nMpH: 7.0Assay Description:Enzymatic activity of IKKε and TBK1 was measured using a homogeneous time resolved fluorescence resonance energy transfer (TR-FRET) assay that m...
Ligand InfoPC cidPC sid
In DepthDetails US Patent
TargetTyrosine-protein kinase JAK2(Homo sapiens (Human))
Gilead Sciences
US Patent
LigandPNGBDBM277983(2-((2S,4R)-4-hydroxy-2-methylpyrrolidin-1-yl)-5-(4...)
Affinity DataIC50:  51nM. Assay description: Enzymatic activity of hJAK2 was measured using a LANCE homogeneous time resolved fluorescence resonance energy transfer (TR-FRET) assay that monitors...
Ligand InfoPC cidPC sid
In DepthDetails US Patent
TargetSerine/threonine-protein kinase TBK1(Homo sapiens (Human))
Gilead Sciences
US Patent
LigandPNGBDBM277983(2-((2S,4R)-4-hydroxy-2-methylpyrrolidin-1-yl)-5-(4...)
Affinity DataIC50:  1nM. Assay description: Enzymatic activity of IKKε and TBK1 was measured using a homogeneous time resolved fluorescence resonance energy transfer (TR-FRET) assay that m...
Ligand InfoPC cidPC sid
In DepthDetails US Patent
TargetInhibitor of nuclear factor kappa-B kinase subunit epsilon(Homo sapiens (Human))
Gilead Sciences
US Patent
LigandPNGBDBM277983(2-((2S,4R)-4-hydroxy-2-methylpyrrolidin-1-yl)-5-(4...)
Affinity DataIC50:  17nM. Assay description: Enzymatic activity of IKKε and TBK1 was measured using a homogeneous time resolved fluorescence resonance energy transfer (TR-FRET) assay that m...
Ligand InfoPC cidPC sid
In DepthDetails US Patent
TargetTyrosine-protein kinase JAK2(Homo sapiens (Human))
Gilead Sciences
US Patent
LigandPNGBDBM277983(2-((2S,4R)-4-hydroxy-2-methylpyrrolidin-1-yl)-5-(4...)
Affinity DataIC50:  5.10E+4nMpH: 7.5Assay Description:Enzymatic activity of hJAK2 was measured using a LANCE homogeneous time resolved fluorescence resonance energy transfer (TR-FRET) assay that monitors...
Ligand InfoPC cidPC sid
In DepthDetails US Patent