BDBM278247 2-(((S)-3,3-difluoro-1-((S)-2-hydroxypropanoyl)piperidin-4-yl)oxy)-5-(4-((4-((R)-3-(hydroxymethyl)-4-(oxetan-3-yl)piperazin-1-yl)phenyl)amino)-1,3,5-triazin-2-yl)benzonitrile::US10040781, Example 469::US10253019, Example 469
SMILES C[C@H](O)C(=O)N1CC[C@H](Oc2ccc(cc2C#N)-c2ncnc(Nc3ccc(cc3)N3CCN(C4COC4)[C@@H](CO)C3)n2)C(F)(F)C1
InChI Key InChIKey=GZORTYZAMMARJL-OUKRDIKDSA-N
Data  6 IC50
  Tab Delimited (TSV)   2D SDfile   Computed 3D by Vconf -m prep SDfile
Find this compound or compounds like it in BindingDB:
Activity Spreadsheet -- Enzyme Inhibition Constant Data from BindingDB
Found 6 hits for monomerid = 278247
TargetSerine/threonine-protein kinase TBK1(Homo sapiens (Human))
Gilead Sciences
US Patent
LigandPNGBDBM278247(2-(((S)-3,3-difluoro-1-((S)-2-hydroxypropanoyl)pip...)
Affinity DataIC50:  2.00E+3nMpH: 7.0Assay Description:Enzymatic activity of IKKε and TBK1 was measured using a homogeneous time resolved fluorescence resonance energy transfer (TR-FRET) assay that m...
Ligand InfoPC cidPC sid
In DepthDetails US Patent
TargetInhibitor of nuclear factor kappa-B kinase subunit epsilon(Homo sapiens (Human))
Gilead Sciences
US Patent
LigandPNGBDBM278247(2-(((S)-3,3-difluoro-1-((S)-2-hydroxypropanoyl)pip...)
Affinity DataIC50:  1.00E+3nMpH: 7.0Assay Description:Enzymatic activity of IKKε and TBK1 was measured using a homogeneous time resolved fluorescence resonance energy transfer (TR-FRET) assay that m...
Ligand InfoPC cidPC sid
In DepthDetails US Patent
TargetTyrosine-protein kinase JAK2(Homo sapiens (Human))
Gilead Sciences
US Patent
LigandPNGBDBM278247(2-(((S)-3,3-difluoro-1-((S)-2-hydroxypropanoyl)pip...)
Affinity DataIC50:  197nM. Assay description: Enzymatic activity of hJAK2 was measured using a LANCE homogeneous time resolved fluorescence resonance energy transfer (TR-FRET) assay that monitors...
Ligand InfoPC cidPC sid
In DepthDetails US Patent
TargetSerine/threonine-protein kinase TBK1(Homo sapiens (Human))
Gilead Sciences
US Patent
LigandPNGBDBM278247(2-(((S)-3,3-difluoro-1-((S)-2-hydroxypropanoyl)pip...)
Affinity DataIC50:  2nM. Assay description: Enzymatic activity of IKKε and TBK1 was measured using a homogeneous time resolved fluorescence resonance energy transfer (TR-FRET) assay that m...
Ligand InfoPC cidPC sid
In DepthDetails US Patent
TargetInhibitor of nuclear factor kappa-B kinase subunit epsilon(Homo sapiens (Human))
Gilead Sciences
US Patent
LigandPNGBDBM278247(2-(((S)-3,3-difluoro-1-((S)-2-hydroxypropanoyl)pip...)
Affinity DataIC50:  1nM. Assay description: Enzymatic activity of IKKε and TBK1 was measured using a homogeneous time resolved fluorescence resonance energy transfer (TR-FRET) assay that m...
Ligand InfoPC cidPC sid
In DepthDetails US Patent
TargetTyrosine-protein kinase JAK2(Homo sapiens (Human))
Gilead Sciences
US Patent
LigandPNGBDBM278247(2-(((S)-3,3-difluoro-1-((S)-2-hydroxypropanoyl)pip...)
Affinity DataIC50:  1.97E+5nMpH: 7.5Assay Description:Enzymatic activity of hJAK2 was measured using a LANCE homogeneous time resolved fluorescence resonance energy transfer (TR-FRET) assay that monitors...
Ligand InfoPC cidPC sid
In DepthDetails US Patent