BDBM27929 Azabicyclooctane scaffold, 14l::N-[(3aR,6S,6aS)-1-[(2S)-3,3-dimethyl-2-[(2S)-2-(methylamino)propanamido]butanoyl]-octahydrocyclopenta[b]pyrrol-6-yl]-2H-1,3-benzodioxole-5-carboxamide
SMILES [H][C@]12CC[C@H](NC(=O)c3ccc4OCOc4c3)[C@@]1([H])N(CC2)C(=O)[C@@H](NC(=O)[C@H](C)NC)C(C)(C)C
InChI Key InChIKey=DSQABRZXPNMKFS-ALBMSPKDSA-N
Data  2 KI
  Tab Delimited (TSV)   2D SDfile   Computed 3D by Vconf -m prep SDfile
Find this compound or compounds like it in BindingDB:
Activity Spreadsheet -- Enzyme Inhibition Constant Data from BindingDB
Found 2 hits for monomerid = 27929
LigandPNGBDBM27929(Azabicyclooctane scaffold, 14l | N-[(3aR,6S,6aS)-1...)
Affinity DataKi:  1.30E+3nM ΔG°:  -7.94kcal/molepH: 7.2 T: 2°C. Assay description: Samples for fluorescence polarization affinity measurements were prepared by addition of serial dilutions of target protein to each well containing a...
In DepthDetails ArticlePubMed
TargetE3 ubiquitin-protein ligase XIAP [241-356](Homo sapiens (Human))
Genentech
LigandPNGBDBM27929(Azabicyclooctane scaffold, 14l | N-[(3aR,6S,6aS)-1...)
Affinity DataKi:  1.80E+3nM. Assay description: Samples for fluorescence polarization affinity measurements were prepared by addition of serial dilutions of target protein to each well containing a...
In DepthDetails ArticlePubMed