BDBM280383 US10030012, Example 13::ethyl 4-[4- methoxy-4- (1-methyl-1H- imidazol-2- yl)piperidin-1- yl]azepane-1- carboxylate
SMILES CCOC(=O)N1CCCC(CC1)N1CCC(CC1)(OC)c1nccn1C
InChI Key InChIKey=KQZQUQXNZKLGBF-UHFFFAOYSA-N
Data  1 EC50
  Tab Delimited (TSV)   2D SDfile   Computed 3D by Vconf -m prep SDfile
Find this compound or compounds like it in BindingDB:
Activity Spreadsheet -- Enzyme Inhibition Constant Data from BindingDB
Found 1 hit for monomerid = 280383
TargetMuscarinic acetylcholine receptor M4(Homo sapiens (Human))
Heptares Therapeutics
US Patent
LigandPNGBDBM280383(US10030012, Example 13 | ethyl 4-[4- methoxy-4- (1...)
Affinity DataEC50:  2.88E+3nM. Assay description: The functional activity of compounds at the M4 and M2 receptors was determined by measuring changes in the level of intracellular calcium ions caused...
Ligand InfoPC cidPC sid
In DepthDetails US Patent