BDBM281054 US10022352, Compound 315
SMILES CC(C)(CO)c1cc2cc(NC(=O)C3(CC3)c3ccc4OC(F)(F)Oc4c3)c(F)cc2n1C[C@@H](O)CO
InChI Key InChIKey=MJUVRTYWUMPBTR-MRXNPFEDSA-N
Data  1 EC50
PDB links: 2 PDB IDs match this monomer.
  Tab Delimited (TSV)   2D SDfile   Computed 3D by Vconf -m prep SDfile
Find this compound or compounds like it in BindingDB:
Activity Spreadsheet -- Enzyme Inhibition Constant Data from BindingDB
Found 1 hit for monomerid = 281054
TargetCystic fibrosis transmembrane conductance regulator(Homo sapiens (Human))
Vertex Pharmaceuticals
US Patent
LigandPNGBDBM281054(US10022352, Compound 315)
Affinity DataEC50:  272nM. Assay description: Single-Channel Recordings activity of wt-CFTR and temperature-corrected ΔF508-CFTR expressed in NIH3T3 cells was observed using excised inside-o...