BDBM282147 (S)-3-(4-(4-amino-7-methyl- 7H-pyrrolo[2,3-d]pyrimidin- 5-yl)benzylamino)-6-cyano- N-(1-(3,4-difluorophenyl) ethyl)pyrazine-2-carboxamide::US10030016, Example 27
SMILES C[C@H](NC(=O)c1nc(cnc1NCc1ccc(cc1)-c1cn(C)c2ncnc(N)c12)C#N)c1ccc(F)c(F)c1
InChI Key InChIKey=FZFUHDBXSVKESO-HNNXBMFYSA-N
Data  1 IC50
  Tab Delimited (TSV)   2D SDfile   Computed 3D by Vconf -m prep SDfile
Find this compound or compounds like it in BindingDB:
Activity Spreadsheet -- Enzyme Inhibition Constant Data from BindingDB
Found 1 hit for monomerid = 282147
Target3-phosphoinositide-dependent protein kinase 1 [51-359](Homo sapiens (Human))
Sunesis Pharmaceuticals
US Patent
LigandPNGBDBM282147((S)-3-(4-(4-amino-7-methyl- 7H-pyrrolo[2,3-d]pyrim...)
Affinity DataIC50: <100nM. Assay description: PDK1 (amino acids 51-359) and AKT2 (amino acids 140-467 fused to PIFtide, amino acids EEQEMFRDFDYIADW) were expressed as N-terminally tagged GST fusi...
Ligand InfoPC cidPC sid
In DepthDetails US Patent