BDBM282167 2-((R)-1-(4-(4 - amino-7H-pyrrolo[2,3-d] pyrimidin-5-yl)phenyl)- 3-(methylamino)-3- oxopropylamino)-5-cyano- N-((S)-1-(4-fluorophenyl) ethyl)nicotinamide::US10030016, Example 47
SMILES CNC(=O)C[C@@H](Nc1ncc(cc1C(=O)N[C@@H](C)c1ccc(F)cc1)C#N)c1ccc(cc1)-c1c[nH]c2ncnc(N)c12
InChI Key
Data  1 IC50
  Tab Delimited (TSV)   2D SDfile   Computed 3D by Vconf -m prep SDfile
Find this compound or compounds like it in BindingDB:
Activity Spreadsheet -- Enzyme Inhibition Constant Data from BindingDB
Found 1 hit for monomerid = 282167
Target3-phosphoinositide-dependent protein kinase 1 [51-359](Homo sapiens (Human))
Sunesis Pharmaceuticals
US Patent
LigandPNGBDBM282167(2-((R)-1-(4-(4 - amino-7H-pyrrolo[2,3-d] pyrimidin...)
Affinity DataIC50: <100nM. Assay description: PDK1 (amino acids 51-359) and AKT2 (amino acids 140-467 fused to PIFtide, amino acids EEQEMFRDFDYIADW) were expressed as N-terminally tagged GST fusi...
Ligand InfoPC cidPC sid
In DepthDetails US Patent