BDBM282617 US9884828, 2-112
SMILES C[C@@H](Nc1c(nnc2cc(ccc12)-c1ccc(=O)n(C)c1)C(N)=O)C1CC1
InChI Key InChIKey=KCONLLWIBPTTAP-LLVKDONJSA-N
Data  1 IC50
  Tab Delimited (TSV)   2D SDfile   Computed 3D by Vconf -m prep SDfile
Find this compound or compounds like it in BindingDB:
Activity Spreadsheet -- Enzyme Inhibition Constant Data from BindingDB
Found 1 hit for monomerid = 282617
TargetLeucine-rich repeat serine/threonine-protein kinase 2(Homo sapiens (Human))
Imago Pharmaceuticals
US Patent
LigandPNGBDBM282617(US9884828, 2-112)
Affinity DataIC50: <6nMpH: 7.5 T: 2°C. Assay description: Compounds as described herein (compounds of Formula I, e.g., compounds of the above Examples) are tested for their in vitro kinase activities using v...
Ligand InfoPC cidPC sid
In DepthDetails US Patent