BDBM282670 US9884828, 9-213
SMILES C[C@@H](Nc1c(nnc2cc(ccc12)-c1ccc(cc1)N1CCOC1=O)C(N)=O)C1CC1
InChI Key InChIKey=YNVDCPYKEYAEFU-CYBMUJFWSA-N
Data  1 IC50
  Tab Delimited (TSV)   2D SDfile   Computed 3D by Vconf -m prep SDfile
Find this compound or compounds like it in BindingDB:
Activity Spreadsheet -- Enzyme Inhibition Constant Data from BindingDB
Found 1 hit for monomerid = 282670
TargetLeucine-rich repeat serine/threonine-protein kinase 2(Homo sapiens (Human))
Imago Pharmaceuticals
US Patent
LigandPNGBDBM282670(US9884828, 9-213)
Affinity DataIC50:  1nMpH: 7.5 T: 2°C. Assay description: Compounds as described herein (compounds of Formula I, e.g., compounds of the above Examples) are tested for their in vitro kinase activities using v...
Ligand InfoPC cidPC sid
In DepthDetails US Patent