BDBM283412 6-((4-(((1-aminoisoquinolin-6- yl)methyl)carbamoyl)pyridin-2-yl)methyl)-3- chloroquinoline-8-carboxamide::US10023557, Example 64::US10266515, Example 64::US10308637, Example 64::US11021463, Example 64::US9611252, Example 64
SMILES NC(=O)c1cc(Cc2cc(ccn2)C(=O)NCc2ccc3c(N)nccc3c2)cc2cc(Cl)cnc12
InChI Key InChIKey=ZEVNHPCICZZSBU-UHFFFAOYSA-N
Data  5 IC50  3 EC50
  Tab Delimited (TSV)   2D SDfile   Computed 3D by Vconf -m prep SDfile
Find this compound or compounds like it in BindingDB:
Activity Spreadsheet -- Enzyme Inhibition Constant Data from BindingDB
Found 8 hits for monomerid = 283412
TargetPlasma kallikrein(Homo sapiens (Human))
Lifesci Pharmaceuticals
US Patent
LigandPNGBDBM283412(6-((4-(((1-aminoisoquinolin-6- yl)methyl)carbamoyl...)
Affinity DataIC50: <100nMpH: 7.5Assay Description:A 10 mM solution of the test compound was made in DMSO. This solution was serially diluted 1:5 in DMSO to yield 2000, 400, 80, 16, 3.2, 0.64, 0.128, ...
Ligand InfoPC cidPC sid
In DepthDetails US Patent
TargetPlasma kallikrein(Homo sapiens (Human))
Lifesci Pharmaceuticals
US Patent
LigandPNGBDBM283412(6-((4-(((1-aminoisoquinolin-6- yl)methyl)carbamoyl...)
Affinity DataEC50: <100nM. Assay description: The test compounds at various concentrations, also prepared by serial dilutions as described above, are added to the test wells. The volume of test c...
Ligand InfoPC cidPC sid
In DepthDetails US Patent
TargetPlasma kallikrein(Homo sapiens (Human))
Lifesci Pharmaceuticals
US Patent
LigandPNGBDBM283412(6-((4-(((1-aminoisoquinolin-6- yl)methyl)carbamoyl...)
Affinity DataIC50: <100nM. Assay description: The ability of the compounds disclosed herein to inhibit human plasma kallikrein activity was quantified according to the procedures below.A 10 mM so...
Ligand InfoPC cidPC sid
In DepthDetails US Patent
TargetPlasma kallikrein(Homo sapiens (Human))
Lifesci Pharmaceuticals
US Patent
LigandPNGBDBM283412(6-((4-(((1-aminoisoquinolin-6- yl)methyl)carbamoyl...)
Affinity DataEC50: <100nM. Assay description: Materials:Plasma kallikrein inhibitor C1NH (Athens Research & Technology, Cat #16-16-031509); Ellagic acid (Sigma, E2250); Substrate Z-FR-2-AMC (GL B...
Ligand InfoPC cidPC sid
In DepthDetails US Patent
TargetPlasma kallikrein(Homo sapiens (Human))
Lifesci Pharmaceuticals
US Patent
LigandPNGBDBM283412(6-((4-(((1-aminoisoquinolin-6- yl)methyl)carbamoyl...)
Affinity DataIC50: <100nM. Assay description: A 10 mM solution of the test compound was made in DMSO. This solution was serially diluted 1:5 in DMSO to yield 2000, 400, 80, 16, 3.2, 0.64, 0.128, ...
Ligand InfoPC cidPC sid
In DepthDetails US Patent
TargetPlasma kallikrein(Homo sapiens (Human))
Lifesci Pharmaceuticals
US Patent
LigandPNGBDBM283412(6-((4-(((1-aminoisoquinolin-6- yl)methyl)carbamoyl...)
Affinity DataEC50: <100nM. Assay description: Human plasma is thawed on ice and centrifuged for 15 min at 4° C. to remove platelets. A 1 mM stock solution of ellagic acid is diluted to 8 μM ...
Ligand InfoPC cidPC sid
In DepthDetails US Patent
TargetPlasma kallikrein(Homo sapiens (Human))
Lifesci Pharmaceuticals
US Patent
LigandPNGBDBM283412(6-((4-(((1-aminoisoquinolin-6- yl)methyl)carbamoyl...)
Affinity DataIC50: <100nM. Assay description: A 10 mM solution of the test compound was made in DMSO. This solution was serially diluted 1:5 in DMSO to yield 2000, 400, 80, 16, 3.2, 0.64, 0.128, ...
Ligand InfoPC cidPC sid
In DepthDetails US Patent
TargetMitogen-activated protein kinase kinase kinase kinase 1(Homo sapiens (Human))
Lifesci Pharmaceuticals
US Patent
LigandPNGBDBM283412(6-((4-(((1-aminoisoquinolin-6- yl)methyl)carbamoyl...)
Affinity DataIC50: <100nM. Assay description: A 10 mM solution of the test compound was made in DMSO. This solution was serially diluted 1:5 in DMSO to yield 2000, 400, 80, 16, 3.2, 0.64, 0.128, ...
Ligand InfoPC cidPC sid
In DepthDetails US Patent