BDBM285678 US10077273, Compound HK-8
SMILES CC(C)[C@]1(c2c(C)n[nH]c2OC(N)=C1C#N)c1cccc(c1)C(F)(F)F
InChI Key
Data  1 IC50
  Tab Delimited (TSV)   2D SDfile   Computed 3D by Vconf -m prep SDfile
Find this compound or compounds like it in BindingDB:
Activity Spreadsheet -- Enzyme Inhibition Constant Data from BindingDB
Found 1 hit for monomerid = 285678
TargetSerine hydroxymethyltransferase, mitochondrial(Homo sapiens (Human))
The Trustees of Princeton University
US Patent
LigandPNGBDBM285678(US10077273, Compound HK-8)
Affinity DataIC50:  400nMpH: 7.4Assay Description:For the SHMT1 and SHMT2 in vitro enzymatic assays, the rate of 5,10-methylene tetrahydrofolate formation catalyzed by SHMT1/2 was indirectly evaluate...
Ligand InfoPC cidPC sid
In DepthDetails US Patent