BDBM286083 1-benzyl-N-(3-(piperazin-1-ylmethyl)benzofuran-6-yl)-1H-pyrazole-4-carboxamide::US10081632, Compound 10::US10758530, Compound 10
SMILES O=C(Nc1ccc2c(CN3CCNCC3)coc2c1)c1cnn(Cc2ccccc2)c1
InChI Key InChIKey=GYFANGIFZZUOEK-UHFFFAOYSA-N
Data  2 IC50
  Tab Delimited (TSV)   2D SDfile   Computed 3D by Vconf -m prep SDfile
Find this compound or compounds like it in BindingDB:
Activity Spreadsheet -- Enzyme Inhibition Constant Data from BindingDB
Found 2 hits for monomerid = 286083
TargetRibosomal protein S6 kinase alpha-2(Homo sapiens (Human))
Phoenix Molecular Designs
US Patent
LigandPNGBDBM286083(1-benzyl-N-(3-(piperazin-1-ylmethyl)benzofuran-6-y...)
Affinity DataIC50: >1.00E+3nM. Assay description: Radioisotope assays were performed for the evaluation of the kinase target profiling and all assays were performed in a designated radioactive workin...
Ligand InfoPC cidPC sid
In DepthDetails US Patent
TargetRibosomal protein S6 kinase alpha-3(Homo sapiens (Human))
Phoenix Molecular Designs
US Patent
LigandPNGBDBM286083(1-benzyl-N-(3-(piperazin-1-ylmethyl)benzofuran-6-y...)
Affinity DataIC50: >1.00E+3nM. Assay description: The assay was initiated by the addition of 33P-ATP and the reaction mixture incubated at 30° C. for 15 minutes. After the incubation period, the assa...
Ligand InfoPC cidPC sid
In DepthDetails US Patent