BDBM286464 6-(4-((3-Fluoro-5-(2-methoxypyrimidin-5-yl)benzyl)oxy)-6-methoxybenzofuran-2-yl)-2-methoxyimidazo[2,1-b][1,3,4]thiadiazole::US9518064, Example 83
SMILES COc1nn2cc(nc2s1)-c1cc2c(OCc3cc(F)cc(c3)-c3cnc(OC)nc3)cc(OC)cc2o1
InChI Key InChIKey=IBYQHLQGHGOYAX-UHFFFAOYSA-N
Data  1 IC50
  Tab Delimited (TSV)   2D SDfile   Computed 3D by Vconf -m prep SDfile
Find this compound or compounds like it in BindingDB:
Activity Spreadsheet -- Enzyme Inhibition Constant Data from BindingDB
Found 1 hit for monomerid = 286464
TargetProteinase-activated receptor 4(Homo sapiens (Human))
Bristol-Myers Squibb
US Patent
LigandPNGBDBM286464(6-(4-((3-Fluoro-5-(2-methoxypyrimidin-5-yl)benzyl)...)
Affinity DataIC50:  0.390nMT: 2°C. Assay description: The activity of the PAR4 antagonists of the present invention were tested in PAR4 expressing cells by monitoring H-Ala-Phe(4-F)-Pro-Gly-Trp-Leu-Val-L...
Ligand InfoPC cidPC sid
In DepthDetails US Patent